{"text_format":"1","workbook":"xlsx","n_sheets":13,"sheets":["Titelblatt","Januar","Februar","März","April","Mai","Juni","Juli","August","September","Oktober","November","Dezember"],"not_rendered":{"charts":0,"images":1,"macros":1,"external_links":0,"defined_names":37,"comments":1,"pivot_tables":0},"unopened":[],"bounds":{"document_bytes":16777216,"sheet_cells":100000,"rows_first":2000,"rows_last":500,"rows_between":2000,"halvings":0,"cell_chars":16384,"cell_head_chars":4096},"cells_cut":0,"cells_raw":0,"read":"whole","date_system":"1900"}

{"sheet":"Titelblatt","index":0,"n_rows":19,"n_cols":9,"rows_kept":19,"cut":false,"hidden":false,"merged":[[20,4,20,5],[18,4,18,5],[19,4,19,5],[16,4,16,5],[17,4,17,5],[2,3,2,5],[10,3,10,5],[11,3,11,5],[12,3,12,5],[13,3,13,5]]}
[]
[]
[null,null,null,{"$f":"Januar!A1","v":"2023-01-01"}]
[]
[]
[]
[]
[]
[]
[]
[null,null,null,"Praxis Dr.med. Vorname Name"]
[null,null,null,"Innere Medizin / Zahnarzt usw."]
[null,null,null,"Strasse"]
[null,null,null,"PLZ + Ort"]
[]
[]
[]
[null,null,null,null,null,null,null,"   E-Mail:","info@rufag.ch"]
[null,null,null,null,null,null,null,"   Homepage:","www.rufag.ch"]

{"sheet":"Januar","index":1,"n_rows":160,"n_cols":13,"rows_kept":160,"cut":false,"hidden":false,"merged":[]}
["2023-01-01"]
[]
["Datum:","Text","FIBU","Einnahmen","Ausgaben","?",null,"Saldo"]
[]
[1,"Saldovortrag",null,null,null,null,null,0]
[null,null,null,null,null,null,1,{"$f":"IF(D6+E6=0,\" \",SUM($H$5+SUM($D$6:D6)-SUM($E$6:E6)))","v":" "},null,null,null,null,"Einblenden"]
[null,null,null,null,null,null,2,{"$f":"IF(D7+E7=0,\" \",SUM($H$5+SUM($D$6:D7)-SUM($E$6:E7)))","v":" "},null,null,null,{"$f":"COUNTIF(A7:F7,\"\")","v":6},{"$f":"IF(L7<6,\"Einblenden\",\"Ausblenden\")","v":"Ausblenden"}]
[null,null,null,null,null,null,3,{"$f":"IF(D8+E8=0,\" \",SUM($H$5+SUM($D$6:D8)-SUM($E$6:E8)))","v":" "},null,null,null,{"$f":"COUNTIF(A8:F8,\"\")","v":6},{"$f":"IF(L8<6,\"Einblenden\",\"Ausblenden\")","v":"Ausblenden"}]
[null,null,null,null,null,null,4,{"$f":"IF(D9+E9=0,\" \",SUM($H$5+SUM($D$6:D9)-SUM($E$6:E9)))","v":" "},null,null,null,6,"Ausblenden"]
[null,null,null,null,null,null,5,{"$f":"IF(D10+E10=0,\" \",SUM($H$5+SUM($D$6:D10)-SUM($E$6:E10)))","v":" "},null,null,null,6,"Ausblenden"]
[null,null,null,null,null,null,6,{"$f":"IF(D11+E11=0,\" \",SUM($H$5+SUM($D$6:D11)-SUM($E$6:E11)))","v":" "},null,null,null,6,"Ausblenden"]
[null,null,null,null,null,null,7,{"$f":"IF(D12+E12=0,\" \",SUM($H$5+SUM($D$6:D12)-SUM($E$6:E12)))","v":" "},null,null,null,6,"Ausblenden"]
[null,null,null,null,null,null,8,{"$f":"IF(D13+E13=0,\" \",SUM($H$5+SUM($D$6:D13)-SUM($E$6:E13)))","v":" "},null,null,null,6,"Ausblenden"]
[null,null,null,null,null,null,9,{"$f":"IF(D14+E14=0,\" \",SUM($H$5+SUM($D$6:D14)-SUM($E$6:E14)))","v":" "},null,null,null,6,"Ausblenden"]
[null,null,null,null,null,null,10,{"$f":"IF(D15+E15=0,\" \",SUM($H$5+SUM($D$6:D15)-SUM($E$6:E15)))","v":" "},null,null,null,6,"Ausblenden"]
[null,null,null,null,null,null,11,{"$f":"IF(D16+E16=0,\" \",SUM($H$5+SUM($D$6:D16)-SUM($E$6:E16)))","v":" "},null,null,null,6,"Ausblenden"]
[null,null,null,null,null,null,12,{"$f":"IF(D17+E17=0,\" \",SUM($H$5+SUM($D$6:D17)-SUM($E$6:E17)))","v":" "},null,null,null,6,"Ausblenden"]
[null,null,null,null,null,null,13,{"$f":"IF(D18+E18=0,\" \",SUM($H$5+SUM($D$6:D18)-SUM($E$6:E18)))","v":" "},null,null,null,6,"Ausblenden"]
[null,null,null,null,null,null,14,{"$f":"IF(D19+E19=0,\" \",SUM($H$5+SUM($D$6:D19)-SUM($E$6:E19)))","v":" "},null,null,null,6,"Ausblenden"]
[null,null,null,null,null,null,15,{"$f":"IF(D20+E20=0,\" \",SUM($H$5+SUM($D$6:D20)-SUM($E$6:E20)))","v":" "},null,null,null,6,"Ausblenden"]
[null,null,null,null,null,null,16,{"$f":"IF(D21+E21=0,\" \",SUM($H$5+SUM($D$6:D21)-SUM($E$6:E21)))","v":" "},null,null,null,6,"Ausblenden"]
[null,null,null,null,null,null,17,{"$f":"IF(D22+E22=0,\" \",SUM($H$5+SUM($D$6:D22)-SUM($E$6:E22)))","v":" "},null,null,null,6,"Ausblenden"]
[null,null,null,null,null,null,18,{"$f":"IF(D23+E23=0,\" \",SUM($H$5+SUM($D$6:D23)-SUM($E$6:E23)))","v":" "},null,null,null,6,"Ausblenden"]
[null,null,null,null,null,null,19,{"$f":"IF(D24+E24=0,\" \",SUM($H$5+SUM($D$6:D24)-SUM($E$6:E24)))","v":" "},null,null,null,6,"Ausblenden"]
[null,null,null,null,null,null,20,{"$f":"IF(D25+E25=0,\" \",SUM($H$5+SUM($D$6:D25)-SUM($E$6:E25)))","v":" "},null,null,null,6,"Ausblenden"]
[null,null,null,null,null,null,21,{"$f":"IF(D26+E26=0,\" \",SUM($H$5+SUM($D$6:D26)-SUM($E$6:E26)))","v":" "},null,null,null,6,"Ausblenden"]
[null,null,null,null,null,null,22,{"$f":"IF(D27+E27=0,\" \",SUM($H$5+SUM($D$6:D27)-SUM($E$6:E27)))","v":" "},null,null,null,6,"Ausblenden"]
[null,null,null,null,null,null,23,{"$f":"IF(D28+E28=0,\" \",SUM($H$5+SUM($D$6:D28)-SUM($E$6:E28)))","v":" "},null,null,null,6,"Ausblenden"]
[null,null,null,null,null,null,24,{"$f":"IF(D29+E29=0,\" \",SUM($H$5+SUM($D$6:D29)-SUM($E$6:E29)))","v":" "},null,null,null,6,"Ausblenden"]
[null,null,null,null,null,null,25,{"$f":"IF(D30+E30=0,\" \",SUM($H$5+SUM($D$6:D30)-SUM($E$6:E30)))","v":" "},null,null,null,6,"Ausblenden"]
[null,null,null,null,null,null,26,{"$f":"IF(D31+E31=0,\" \",SUM($H$5+SUM($D$6:D31)-SUM($E$6:E31)))","v":" "},null,null,null,6,"Ausblenden"]
[null,null,null,null,null,null,27,{"$f":"IF(D32+E32=0,\" \",SUM($H$5+SUM($D$6:D32)-SUM($E$6:E32)))","v":" "},null,null,null,6,"Ausblenden"]
[null,null,null,null,null,null,28,{"$f":"IF(D33+E33=0,\" \",SUM($H$5+SUM($D$6:D33)-SUM($E$6:E33)))","v":" "},null,null,null,6,"Ausblenden"]
[null,null,null,null,null,null,29,{"$f":"IF(D34+E34=0,\" \",SUM($H$5+SUM($D$6:D34)-SUM($E$6:E34)))","v":" "},null,null,null,6,"Ausblenden"]
[null,null,null,null,null,null,30,{"$f":"IF(D35+E35=0,\" \",SUM($H$5+SUM($D$6:D35)-SUM($E$6:E35)))","v":" "},null,null,null,6,"Ausblenden"]
[null,null,null,null,null,null,31,{"$f":"IF(D36+E36=0,\" \",SUM($H$5+SUM($D$6:D36)-SUM($E$6:E36)))","v":" "},null,null,null,6,"Ausblenden"]
[null,null,null,null,null,null,32,{"$f":"IF(D37+E37=0,\" \",SUM($H$5+SUM($D$6:D37)-SUM($E$6:E37)))","v":" "},null,null,null,6,"Ausblenden"]
[null,null,null,null,null,null,33,{"$f":"IF(D38+E38=0,\" \",SUM($H$5+SUM($D$6:D38)-SUM($E$6:E38)))","v":" "},null,null,null,6,"Ausblenden"]
[null,null,null,null,null,null,34,{"$f":"IF(D39+E39=0,\" \",SUM($H$5+SUM($D$6:D39)-SUM($E$6:E39)))","v":" "},null,null,null,6,"Ausblenden"]
[null,null,null,null,null,null,35,{"$f":"IF(D40+E40=0,\" \",SUM($H$5+SUM($D$6:D40)-SUM($E$6:E40)))","v":" "},null,null,null,6,"Ausblenden"]
[null,null,null,null,null,null,36,{"$f":"IF(D41+E41=0,\" \",SUM($H$5+SUM($D$6:D41)-SUM($E$6:E41)))","v":" "},null,null,null,6,"Ausblenden"]
[null,null,null,null,null,null,37,{"$f":"IF(D42+E42=0,\" \",SUM($H$5+SUM($D$6:D42)-SUM($E$6:E42)))","v":" "},null,null,null,6,"Ausblenden"]
[null,null,null,null,null,null,38,{"$f":"IF(D43+E43=0,\" \",SUM($H$5+SUM($D$6:D43)-SUM($E$6:E43)))","v":" "},null,null,null,6,"Ausblenden"]
[null,null,null,null,null,null,39,{"$f":"IF(D44+E44=0,\" \",SUM($H$5+SUM($D$6:D44)-SUM($E$6:E44)))","v":" "},null,null,null,6,"Ausblenden"]
[null,null,null,null,null,null,40,{"$f":"IF(D45+E45=0,\" \",SUM($H$5+SUM($D$6:D45)-SUM($E$6:E45)))","v":" "},null,null,null,6,"Ausblenden"]
[null,null,null,null,null,null,41,{"$f":"IF(D46+E46=0,\" \",SUM($H$5+SUM($D$6:D46)-SUM($E$6:E46)))","v":" "},null,null,null,6,"Ausblenden"]
[null,null,null,null,null,null,42,{"$f":"IF(D47+E47=0,\" \",SUM($H$5+SUM($D$6:D47)-SUM($E$6:E47)))","v":" "},null,null,null,6,"Ausblenden"]
[null,null,null,null,null,null,43,{"$f":"IF(D48+E48=0,\" \",SUM($H$5+SUM($D$6:D48)-SUM($E$6:E48)))","v":" "},null,null,null,6,"Ausblenden"]
[null,null,null,null,null,null,44,{"$f":"IF(D49+E49=0,\" \",SUM($H$5+SUM($D$6:D49)-SUM($E$6:E49)))","v":" "},null,null,null,6,"Ausblenden"]
[null,null,null,null,null,null,45,{"$f":"IF(D50+E50=0,\" \",SUM($H$5+SUM($D$6:D50)-SUM($E$6:E50)))","v":" "},null,null,null,6,"Ausblenden"]
[null,null,null,null,null,null,46,{"$f":"IF(D51+E51=0,\" \",SUM($H$5+SUM($D$6:D51)-SUM($E$6:E51)))","v":" "},null,null,null,6,"Ausblenden"]
[null,null,null,null,null,null,47,{"$f":"IF(D52+E52=0,\" \",SUM($H$5+SUM($D$6:D52)-SUM($E$6:E52)))","v":" "},null,null,null,6,"Ausblenden"]
[null,{"$f":"IF(SUM(D59:E105)<>0,\"Uebertrag\",\"Total\")","v":"Total"},null,{"$f":"SUM(D5:D52)","v":0},{"$f":"SUM(E5:E52)","v":0},null,null,{"$f":"H5+D53-E53","v":0},null,null,null,null,"Einblenden"]
[{"$f":"A1","v":"2023-01-01"},null,null,null,null,null,null,"Seite 2",null,null,null,null,{"$f":"IF(SUM($L$59:$L$105)<282,\"Einblenden\",\"Ausblenden\")","v":"Ausblenden"}]
[null,null,null,null,null,null,null,null,null,null,null,null,{"$f":"IF(SUM($L$59:$L$105)<282,\"Einblenden\",\"Ausblenden\")","v":"Ausblenden"}]
["Datum:","Text","FIBU","Einnahmen","Ausgaben",{"$f":"F3","v":"?"},null,"Saldo",null,null,null,null,{"$f":"IF(SUM($L$59:$L$105)<282,\"Einblenden\",\"Ausblenden\")","v":"Ausblenden"}]
[null,null,null,null,null,null,null,null,null,null,null,null,{"$f":"IF(SUM($L$59:$L$105)<282,\"Einblenden\",\"Ausblenden\")","v":"Ausblenden"}]
[null,"Uebertrag",null,{"$f":"D53","v":0},{"$f":"E53","v":0},null,null,{"$f":"H53","v":0},null,null,null,null,{"$f":"IF(SUM($L$59:$L$105)<282,\"Einblenden\",\"Ausblenden\")","v":"Ausblenden"}]
[null,null,null,null,null,null,48,{"$f":"IF(D59+E59=0,\" \",SUM($H$5+SUM($D$6:$D$52,$D$59:D59)-SUM($E$6:$E$52,$E$59:E59)))","v":" "},null,null,null,{"$f":"COUNTIF(A59:F59,\"\")","v":6},{"$f":"IF(L59<6,\"Einblenden\",\"Ausblenden\")","v":"Ausblenden"}]
[null,null,null,null,null,null,49,{"$f":"IF(D60+E60=0,\" \",SUM($H$5+SUM($D$6:$D$52,$D$59:D60)-SUM($E$6:$E$52,$E$59:E60)))","v":" "},null,null,null,{"$f":"COUNTIF(A60:F60,\"\")","v":6},{"$f":"IF(L60<6,\"Einblenden\",\"Ausblenden\")","v":"Ausblenden"}]
[null,null,null,null,null,null,50,{"$f":"IF(D61+E61=0,\" \",SUM($H$5+SUM($D$6:$D$52,$D$59:D61)-SUM($E$6:$E$52,$E$59:E61)))","v":" "},null,null,null,6,"Ausblenden"]
[null,null,null,null,null,null,51,{"$f":"IF(D62+E62=0,\" \",SUM($H$5+SUM($D$6:$D$52,$D$59:D62)-SUM($E$6:$E$52,$E$59:E62)))","v":" "},null,null,null,6,"Ausblenden"]
[null,null,null,null,null,null,52,{"$f":"IF(D63+E63=0,\" \",SUM($H$5+SUM($D$6:$D$52,$D$59:D63)-SUM($E$6:$E$52,$E$59:E63)))","v":" "},null,null,null,6,"Ausblenden"]
[null,null,null,null,null,null,53,{"$f":"IF(D64+E64=0,\" \",SUM($H$5+SUM($D$6:$D$52,$D$59:D64)-SUM($E$6:$E$52,$E$59:E64)))","v":" "},null,null,null,6,"Ausblenden"]
[null,null,null,null,null,null,54,{"$f":"IF(D65+E65=0,\" \",SUM($H$5+SUM($D$6:$D$52,$D$59:D65)-SUM($E$6:$E$52,$E$59:E65)))","v":" "},null,null,null,6,"Ausblenden"]
[null,null,null,null,null,null,55,{"$f":"IF(D66+E66=0,\" \",SUM($H$5+SUM($D$6:$D$52,$D$59:D66)-SUM($E$6:$E$52,$E$59:E66)))","v":" "},null,null,null,6,"Ausblenden"]
[null,null,null,null,null,null,56,{"$f":"IF(D67+E67=0,\" \",SUM($H$5+SUM($D$6:$D$52,$D$59:D67)-SUM($E$6:$E$52,$E$59:E67)))","v":" "},null,null,null,6,"Ausblenden"]
[null,null,null,null,null,null,57,{"$f":"IF(D68+E68=0,\" \",SUM($H$5+SUM($D$6:$D$52,$D$59:D68)-SUM($E$6:$E$52,$E$59:E68)))","v":" "},null,null,null,6,"Ausblenden"]
[null,null,null,null,null,null,58,{"$f":"IF(D69+E69=0,\" \",SUM($H$5+SUM($D$6:$D$52,$D$59:D69)-SUM($E$6:$E$52,$E$59:E69)))","v":" "},null,null,null,6,"Ausblenden"]
[null,null,null,null,null,null,59,{"$f":"IF(D70+E70=0,\" \",SUM($H$5+SUM($D$6:$D$52,$D$59:D70)-SUM($E$6:$E$52,$E$59:E70)))","v":" "},null,null,null,6,"Ausblenden"]
[null,null,null,null,null,null,60,{"$f":"IF(D71+E71=0,\" \",SUM($H$5+SUM($D$6:$D$52,$D$59:D71)-SUM($E$6:$E$52,$E$59:E71)))","v":" "},null,null,null,6,"Ausblenden"]
[null,null,null,null,null,null,61,{"$f":"IF(D72+E72=0,\" \",SUM($H$5+SUM($D$6:$D$52,$D$59:D72)-SUM($E$6:$E$52,$E$59:E72)))","v":" "},null,null,null,6,"Ausblenden"]
[null,null,null,null,null,null,62,{"$f":"IF(D73+E73=0,\" \",SUM($H$5+SUM($D$6:$D$52,$D$59:D73)-SUM($E$6:$E$52,$E$59:E73)))","v":" "},null,null,null,6,"Ausblenden"]
[null,null,null,null,null,null,63,{"$f":"IF(D74+E74=0,\" \",SUM($H$5+SUM($D$6:$D$52,$D$59:D74)-SUM($E$6:$E$52,$E$59:E74)))","v":" "},null,null,null,6,"Ausblenden"]
[null,null,null,null,null,null,64,{"$f":"IF(D75+E75=0,\" \",SUM($H$5+SUM($D$6:$D$52,$D$59:D75)-SUM($E$6:$E$52,$E$59:E75)))","v":" "},null,null,null,6,"Ausblenden"]
[null,null,null,null,null,null,65,{"$f":"IF(D76+E76=0,\" \",SUM($H$5+SUM($D$6:$D$52,$D$59:D76)-SUM($E$6:$E$52,$E$59:E76)))","v":" "},null,null,null,6,"Ausblenden"]
[null,null,null,null,null,null,66,{"$f":"IF(D77+E77=0,\" \",SUM($H$5+SUM($D$6:$D$52,$D$59:D77)-SUM($E$6:$E$52,$E$59:E77)))","v":" "},null,null,null,6,"Ausblenden"]
[null,null,null,null,null,null,67,{"$f":"IF(D78+E78=0,\" \",SUM($H$5+SUM($D$6:$D$52,$D$59:D78)-SUM($E$6:$E$52,$E$59:E78)))","v":" "},null,null,null,6,"Ausblenden"]
[null,null,null,null,null,null,68,{"$f":"IF(D79+E79=0,\" \",SUM($H$5+SUM($D$6:$D$52,$D$59:D79)-SUM($E$6:$E$52,$E$59:E79)))","v":" "},null,null,null,6,"Ausblenden"]
[null,null,null,null,null,null,69,{"$f":"IF(D80+E80=0,\" \",SUM($H$5+SUM($D$6:$D$52,$D$59:D80)-SUM($E$6:$E$52,$E$59:E80)))","v":" "},null,null,null,6,"Ausblenden"]
[null,null,null,null,null,null,70,{"$f":"IF(D81+E81=0,\" \",SUM($H$5+SUM($D$6:$D$52,$D$59:D81)-SUM($E$6:$E$52,$E$59:E81)))","v":" "},null,null,null,6,"Ausblenden"]
[null,null,null,null,null,null,71,{"$f":"IF(D82+E82=0,\" \",SUM($H$5+SUM($D$6:$D$52,$D$59:D82)-SUM($E$6:$E$52,$E$59:E82)))","v":" "},null,null,null,6,"Ausblenden"]
[null,null,null,null,null,null,72,{"$f":"IF(D83+E83=0,\" \",SUM($H$5+SUM($D$6:$D$52,$D$59:D83)-SUM($E$6:$E$52,$E$59:E83)))","v":" "},null,null,null,6,"Ausblenden"]
[null,null,null,null,null,null,73,{"$f":"IF(D84+E84=0,\" \",SUM($H$5+SUM($D$6:$D$52,$D$59:D84)-SUM($E$6:$E$52,$E$59:E84)))","v":" "},null,null,null,6,"Ausblenden"]
[null,null,null,null,null,null,74,{"$f":"IF(D85+E85=0,\" \",SUM($H$5+SUM($D$6:$D$52,$D$59:D85)-SUM($E$6:$E$52,$E$59:E85)))","v":" "},null,null,null,6,"Ausblenden"]
[null,null,null,null,null,null,75,{"$f":"IF(D86+E86=0,\" \",SUM($H$5+SUM($D$6:$D$52,$D$59:D86)-SUM($E$6:$E$52,$E$59:E86)))","v":" "},null,null,null,6,"Ausblenden"]
[null,null,null,null,null,null,76,{"$f":"IF(D87+E87=0,\" \",SUM($H$5+SUM($D$6:$D$52,$D$59:D87)-SUM($E$6:$E$52,$E$59:E87)))","v":" "},null,null,null,6,"Ausblenden"]
[null,null,null,null,null,null,77,{"$f":"IF(D88+E88=0,\" \",SUM($H$5+SUM($D$6:$D$52,$D$59:D88)-SUM($E$6:$E$52,$E$59:E88)))","v":" "},null,null,null,6,"Ausblenden"]
[null,null,null,null,null,null,78,{"$f":"IF(D89+E89=0,\" \",SUM($H$5+SUM($D$6:$D$52,$D$59:D89)-SUM($E$6:$E$52,$E$59:E89)))","v":" "},null,null,null,6,"Ausblenden"]
[null,null,null,null,null,null,79,{"$f":"IF(D90+E90=0,\" \",SUM($H$5+SUM($D$6:$D$52,$D$59:D90)-SUM($E$6:$E$52,$E$59:E90)))","v":" "},null,null,null,6,"Ausblenden"]
[null,null,null,null,null,null,80,{"$f":"IF(D91+E91=0,\" \",SUM($H$5+SUM($D$6:$D$52,$D$59:D91)-SUM($E$6:$E$52,$E$59:E91)))","v":" "},null,null,null,6,"Ausblenden"]
[null,null,null,null,null,null,81,{"$f":"IF(D92+E92=0,\" \",SUM($H$5+SUM($D$6:$D$52,$D$59:D92)-SUM($E$6:$E$52,$E$59:E92)))","v":" "},null,null,null,6,"Ausblenden"]
[null,null,null,null,null,null,82,{"$f":"IF(D93+E93=0,\" \",SUM($H$5+SUM($D$6:$D$52,$D$59:D93)-SUM($E$6:$E$52,$E$59:E93)))","v":" "},null,null,null,6,"Ausblenden"]
[null,null,null,null,null,null,83,{"$f":"IF(D94+E94=0,\" \",SUM($H$5+SUM($D$6:$D$52,$D$59:D94)-SUM($E$6:$E$52,$E$59:E94)))","v":" "},null,null,null,6,"Ausblenden"]
[null,null,null,null,null,null,84,{"$f":"IF(D95+E95=0,\" \",SUM($H$5+SUM($D$6:$D$52,$D$59:D95)-SUM($E$6:$E$52,$E$59:E95)))","v":" "},null,null,null,6,"Ausblenden"]
[null,null,null,null,null,null,85,{"$f":"IF(D96+E96=0,\" \",SUM($H$5+SUM($D$6:$D$52,$D$59:D96)-SUM($E$6:$E$52,$E$59:E96)))","v":" "},null,null,null,6,"Ausblenden"]
[null,null,null,null,null,null,86,{"$f":"IF(D97+E97=0,\" \",SUM($H$5+SUM($D$6:$D$52,$D$59:D97)-SUM($E$6:$E$52,$E$59:E97)))","v":" "},null,null,null,6,"Ausblenden"]
[null,null,null,null,null,null,87,{"$f":"IF(D98+E98=0,\" \",SUM($H$5+SUM($D$6:$D$52,$D$59:D98)-SUM($E$6:$E$52,$E$59:E98)))","v":" "},null,null,null,6,"Ausblenden"]
[null,null,null,null,null,null,88,{"$f":"IF(D99+E99=0,\" \",SUM($H$5+SUM($D$6:$D$52,$D$59:D99)-SUM($E$6:$E$52,$E$59:E99)))","v":" "},null,null,null,6,"Ausblenden"]
[null,null,null,null,null,null,89,{"$f":"IF(D100+E100=0,\" \",SUM($H$5+SUM($D$6:$D$52,$D$59:D100)-SUM($E$6:$E$52,$E$59:E100)))","v":" "},null,null,null,6,"Ausblenden"]
[null,null,null,null,null,null,90,{"$f":"IF(D101+E101=0,\" \",SUM($H$5+SUM($D$6:$D$52,$D$59:D101)-SUM($E$6:$E$52,$E$59:E101)))","v":" "},null,null,null,6,"Ausblenden"]
[null,null,null,null,null,null,91,{"$f":"IF(D102+E102=0,\" \",SUM($H$5+SUM($D$6:$D$52,$D$59:D102)-SUM($E$6:$E$52,$E$59:E102)))","v":" "},null,null,null,6,"Ausblenden"]
[null,null,null,null,null,null,92,{"$f":"IF(D103+E103=0,\" \",SUM($H$5+SUM($D$6:$D$52,$D$59:D103)-SUM($E$6:$E$52,$E$59:E103)))","v":" "},null,null,null,6,"Ausblenden"]
[null,null,null,null,null,null,93,{"$f":"IF(D104+E104=0,\" \",SUM($H$5+SUM($D$6:$D$52,$D$59:D104)-SUM($E$6:$E$52,$E$59:E104)))","v":" "},null,null,null,6,"Ausblenden"]
[null,null,null,null,null,null,94,{"$f":"IF(D105+E105=0,\" \",SUM($H$5+SUM($D$6:$D$52,$D$59:D105)-SUM($E$6:$E$52,$E$59:E105)))","v":" "},null,null,null,{"$f":"COUNTIF(A105:F105,\"\")","v":6},"Ausblenden"]
[null,{"$f":"IF(SUM(D112:E158)<>0,\"Uebertrag\",\"Total\")","v":"Total"},null,{"$f":"SUM(D58:D105)","v":0},{"$f":"SUM(E58:E105)","v":0},null,null,{"$f":"$H$5+D106-E106","v":0},null,null,null,null,{"$f":"IF(SUM($L$59:$L$105)<282,\"Einblenden\",\"Ausblenden\")","v":"Ausblenden"}]
[{"$f":"A1","v":"2023-01-01"},null,null,null,null,null,null,"Seite 3",null,null,null,null,{"$f":"IF(SUM($L$112:$L$158)<282,\"Einblenden\",\"Ausblenden\")","v":"Ausblenden"}]
[null,null,null,null,null,null,null,null,null,null,null,null,{"$f":"IF(SUM($L$112:$L$158)<282,\"Einblenden\",\"Ausblenden\")","v":"Ausblenden"}]
["Datum:","Text","FIBU","Einnahmen","Ausgaben",{"$f":"F3","v":"?"},null,"Saldo",null,null,null,null,{"$f":"IF(SUM($L$112:$L$158)<282,\"Einblenden\",\"Ausblenden\")","v":"Ausblenden"}]
[null,null,null,null,null,null,null,null,null,null,null,null,{"$f":"IF(SUM($L$112:$L$158)<282,\"Einblenden\",\"Ausblenden\")","v":"Ausblenden"}]
[null,"Uebertrag",null,{"$f":"D106","v":0},{"$f":"E106","v":0},null,null,{"$f":"H106","v":0},null,null,null,null,{"$f":"IF(SUM($L$112:$L$158)<282,\"Einblenden\",\"Ausblenden\")","v":"Ausblenden"}]
[null,null,null,null,null,null,95,{"$f":"IF(D112+E112=0,\" \",SUM($H$5+SUM($D$6:$D$52,$D$59:$D$105,$D$112:D112)-SUM($E$6:$E$52,$E$59:$E$105,$E$112:E112)))","v":" "},null,null,null,{"$f":"COUNTIF(A112:F112,\"\")","v":6},{"$f":"IF(L112<6,\"Einblenden\",\"Ausblenden\")","v":"Ausblenden"}]
[null,null,null,null,null,null,96,{"$f":"IF(D113+E113=0,\" \",SUM($H$5+SUM($D$6:$D$52,$D$59:$D$105,$D$112:D113)-SUM($E$6:$E$52,$E$59:$E$105,$E$112:E113)))","v":" "},null,null,null,{"$f":"COUNTIF(A113:F113,\"\")","v":6},"Ausblenden"]
[null,null,null,null,null,null,97,{"$f":"IF(D114+E114=0,\" \",SUM($H$5+SUM($D$6:$D$52,$D$59:$D$105,$D$112:D114)-SUM($E$6:$E$52,$E$59:$E$105,$E$112:E114)))","v":" "},null,null,null,6,"Ausblenden"]
[null,null,null,null,null,null,98,{"$f":"IF(D115+E115=0,\" \",SUM($H$5+SUM($D$6:$D$52,$D$59:$D$105,$D$112:D115)-SUM($E$6:$E$52,$E$59:$E$105,$E$112:E115)))","v":" "},null,null,null,6,"Ausblenden"]
[null,null,null,null,null,null,99,{"$f":"IF(D116+E116=0,\" \",SUM($H$5+SUM($D$6:$D$52,$D$59:$D$105,$D$112:D116)-SUM($E$6:$E$52,$E$59:$E$105,$E$112:E116)))","v":" "},null,null,null,6,"Ausblenden"]
[null,null,null,null,null,null,100,{"$f":"IF(D117+E117=0,\" \",SUM($H$5+SUM($D$6:$D$52,$D$59:$D$105,$D$112:D117)-SUM($E$6:$E$52,$E$59:$E$105,$E$112:E117)))","v":" "},null,null,null,6,"Ausblenden"]
[null,null,null,null,null,null,101,{"$f":"IF(D118+E118=0,\" \",SUM($H$5+SUM($D$6:$D$52,$D$59:$D$105,$D$112:D118)-SUM($E$6:$E$52,$E$59:$E$105,$E$112:E118)))","v":" "},null,null,null,6,"Ausblenden"]
[null,null,null,null,null,null,102,{"$f":"IF(D119+E119=0,\" \",SUM($H$5+SUM($D$6:$D$52,$D$59:$D$105,$D$112:D119)-SUM($E$6:$E$52,$E$59:$E$105,$E$112:E119)))","v":" "},null,null,null,6,"Ausblenden"]
[null,null,null,null,null,null,103,{"$f":"IF(D120+E120=0,\" \",SUM($H$5+SUM($D$6:$D$52,$D$59:$D$105,$D$112:D120)-SUM($E$6:$E$52,$E$59:$E$105,$E$112:E120)))","v":" "},null,null,null,6,"Ausblenden"]
[null,null,null,null,null,null,104,{"$f":"IF(D121+E121=0,\" \",SUM($H$5+SUM($D$6:$D$52,$D$59:$D$105,$D$112:D121)-SUM($E$6:$E$52,$E$59:$E$105,$E$112:E121)))","v":" "},null,null,null,6,"Ausblenden"]
[null,null,null,null,null,null,105,{"$f":"IF(D122+E122=0,\" \",SUM($H$5+SUM($D$6:$D$52,$D$59:$D$105,$D$112:D122)-SUM($E$6:$E$52,$E$59:$E$105,$E$112:E122)))","v":" "},null,null,null,6,"Ausblenden"]
[null,null,null,null,null,null,106,{"$f":"IF(D123+E123=0,\" \",SUM($H$5+SUM($D$6:$D$52,$D$59:$D$105,$D$112:D123)-SUM($E$6:$E$52,$E$59:$E$105,$E$112:E123)))","v":" "},null,null,null,6,"Ausblenden"]
[null,null,null,null,null,null,107,{"$f":"IF(D124+E124=0,\" \",SUM($H$5+SUM($D$6:$D$52,$D$59:$D$105,$D$112:D124)-SUM($E$6:$E$52,$E$59:$E$105,$E$112:E124)))","v":" "},null,null,null,6,"Ausblenden"]
[null,null,null,null,null,null,108,{"$f":"IF(D125+E125=0,\" \",SUM($H$5+SUM($D$6:$D$52,$D$59:$D$105,$D$112:D125)-SUM($E$6:$E$52,$E$59:$E$105,$E$112:E125)))","v":" "},null,null,null,6,"Ausblenden"]
[null,null,null,null,null,null,109,{"$f":"IF(D126+E126=0,\" \",SUM($H$5+SUM($D$6:$D$52,$D$59:$D$105,$D$112:D126)-SUM($E$6:$E$52,$E$59:$E$105,$E$112:E126)))","v":" "},null,null,null,6,"Ausblenden"]
[null,null,null,null,null,null,110,{"$f":"IF(D127+E127=0,\" \",SUM($H$5+SUM($D$6:$D$52,$D$59:$D$105,$D$112:D127)-SUM($E$6:$E$52,$E$59:$E$105,$E$112:E127)))","v":" "},null,null,null,6,"Ausblenden"]
[null,null,null,null,null,null,111,{"$f":"IF(D128+E128=0,\" \",SUM($H$5+SUM($D$6:$D$52,$D$59:$D$105,$D$112:D128)-SUM($E$6:$E$52,$E$59:$E$105,$E$112:E128)))","v":" "},null,null,null,6,"Ausblenden"]
[null,null,null,null,null,null,112,{"$f":"IF(D129+E129=0,\" \",SUM($H$5+SUM($D$6:$D$52,$D$59:$D$105,$D$112:D129)-SUM($E$6:$E$52,$E$59:$E$105,$E$112:E129)))","v":" "},null,null,null,6,"Ausblenden"]
[null,null,null,null,null,null,113,{"$f":"IF(D130+E130=0,\" \",SUM($H$5+SUM($D$6:$D$52,$D$59:$D$105,$D$112:D130)-SUM($E$6:$E$52,$E$59:$E$105,$E$112:E130)))","v":" "},null,null,null,6,"Ausblenden"]
[null,null,null,null,null,null,114,{"$f":"IF(D131+E131=0,\" \",SUM($H$5+SUM($D$6:$D$52,$D$59:$D$105,$D$112:D131)-SUM($E$6:$E$52,$E$59:$E$105,$E$112:E131)))","v":" "},null,null,null,6,"Ausblenden"]
[null,null,null,null,null,null,115,{"$f":"IF(D132+E132=0,\" \",SUM($H$5+SUM($D$6:$D$52,$D$59:$D$105,$D$112:D132)-SUM($E$6:$E$52,$E$59:$E$105,$E$112:E132)))","v":" "},null,null,null,6,"Ausblenden"]
[null,null,null,null,null,null,116,{"$f":"IF(D133+E133=0,\" \",SUM($H$5+SUM($D$6:$D$52,$D$59:$D$105,$D$112:D133)-SUM($E$6:$E$52,$E$59:$E$105,$E$112:E133)))","v":" "},null,null,null,6,"Ausblenden"]
[null,null,null,null,null,null,117,{"$f":"IF(D134+E134=0,\" \",SUM($H$5+SUM($D$6:$D$52,$D$59:$D$105,$D$112:D134)-SUM($E$6:$E$52,$E$59:$E$105,$E$112:E134)))","v":" "},null,null,null,6,"Ausblenden"]
[null,null,null,null,null,null,118,{"$f":"IF(D135+E135=0,\" \",SUM($H$5+SUM($D$6:$D$52,$D$59:$D$105,$D$112:D135)-SUM($E$6:$E$52,$E$59:$E$105,$E$112:E135)))","v":" "},null,null,null,6,"Ausblenden"]
[null,null,null,null,null,null,119,{"$f":"IF(D136+E136=0,\" \",SUM($H$5+SUM($D$6:$D$52,$D$59:$D$105,$D$112:D136)-SUM($E$6:$E$52,$E$59:$E$105,$E$112:E136)))","v":" "},null,null,null,6,"Ausblenden"]
[null,null,null,null,null,null,120,{"$f":"IF(D137+E137=0,\" \",SUM($H$5+SUM($D$6:$D$52,$D$59:$D$105,$D$112:D137)-SUM($E$6:$E$52,$E$59:$E$105,$E$112:E137)))","v":" "},null,null,null,6,"Ausblenden"]
[null,null,null,null,null,null,121,{"$f":"IF(D138+E138=0,\" \",SUM($H$5+SUM($D$6:$D$52,$D$59:$D$105,$D$112:D138)-SUM($E$6:$E$52,$E$59:$E$105,$E$112:E138)))","v":" "},null,null,null,6,"Ausblenden"]
[null,null,null,null,null,null,122,{"$f":"IF(D139+E139=0,\" \",SUM($H$5+SUM($D$6:$D$52,$D$59:$D$105,$D$112:D139)-SUM($E$6:$E$52,$E$59:$E$105,$E$112:E139)))","v":" "},null,null,null,6,"Ausblenden"]
[null,null,null,null,null,null,123,{"$f":"IF(D140+E140=0,\" \",SUM($H$5+SUM($D$6:$D$52,$D$59:$D$105,$D$112:D140)-SUM($E$6:$E$52,$E$59:$E$105,$E$112:E140)))","v":" "},null,null,null,6,"Ausblenden"]
[null,null,null,null,null,null,124,{"$f":"IF(D141+E141=0,\" \",SUM($H$5+SUM($D$6:$D$52,$D$59:$D$105,$D$112:D141)-SUM($E$6:$E$52,$E$59:$E$105,$E$112:E141)))","v":" "},null,null,null,6,"Ausblenden"]
[null,null,null,null,null,null,125,{"$f":"IF(D142+E142=0,\" \",SUM($H$5+SUM($D$6:$D$52,$D$59:$D$105,$D$112:D142)-SUM($E$6:$E$52,$E$59:$E$105,$E$112:E142)))","v":" "},null,null,null,6,"Ausblenden"]
[null,null,null,null,null,null,126,{"$f":"IF(D143+E143=0,\" \",SUM($H$5+SUM($D$6:$D$52,$D$59:$D$105,$D$112:D143)-SUM($E$6:$E$52,$E$59:$E$105,$E$112:E143)))","v":" "},null,null,null,6,"Ausblenden"]
[null,null,null,null,null,null,127,{"$f":"IF(D144+E144=0,\" \",SUM($H$5+SUM($D$6:$D$52,$D$59:$D$105,$D$112:D144)-SUM($E$6:$E$52,$E$59:$E$105,$E$112:E144)))","v":" "},null,null,null,6,"Ausblenden"]
[null,null,null,null,null,null,128,{"$f":"IF(D145+E145=0,\" \",SUM($H$5+SUM($D$6:$D$52,$D$59:$D$105,$D$112:D145)-SUM($E$6:$E$52,$E$59:$E$105,$E$112:E145)))","v":" "},null,null,null,6,"Ausblenden"]
[null,null,null,null,null,null,129,{"$f":"IF(D146+E146=0,\" \",SUM($H$5+SUM($D$6:$D$52,$D$59:$D$105,$D$112:D146)-SUM($E$6:$E$52,$E$59:$E$105,$E$112:E146)))","v":" "},null,null,null,6,"Ausblenden"]
[null,null,null,null,null,null,130,{"$f":"IF(D147+E147=0,\" \",SUM($H$5+SUM($D$6:$D$52,$D$59:$D$105,$D$112:D147)-SUM($E$6:$E$52,$E$59:$E$105,$E$112:E147)))","v":" "},null,null,null,6,"Ausblenden"]
[null,null,null,null,null,null,131,{"$f":"IF(D148+E148=0,\" \",SUM($H$5+SUM($D$6:$D$52,$D$59:$D$105,$D$112:D148)-SUM($E$6:$E$52,$E$59:$E$105,$E$112:E148)))","v":" "},null,null,null,6,"Ausblenden"]
[null,null,null,null,null,null,132,{"$f":"IF(D149+E149=0,\" \",SUM($H$5+SUM($D$6:$D$52,$D$59:$D$105,$D$112:D149)-SUM($E$6:$E$52,$E$59:$E$105,$E$112:E149)))","v":" "},null,null,null,6,"Ausblenden"]
[null,null,null,null,null,null,133,{"$f":"IF(D150+E150=0,\" \",SUM($H$5+SUM($D$6:$D$52,$D$59:$D$105,$D$112:D150)-SUM($E$6:$E$52,$E$59:$E$105,$E$112:E150)))","v":" "},null,null,null,6,"Ausblenden"]
[null,null,null,null,null,null,134,{"$f":"IF(D151+E151=0,\" \",SUM($H$5+SUM($D$6:$D$52,$D$59:$D$105,$D$112:D151)-SUM($E$6:$E$52,$E$59:$E$105,$E$112:E151)))","v":" "},null,null,null,6,"Ausblenden"]
[null,null,null,null,null,null,135,{"$f":"IF(D152+E152=0,\" \",SUM($H$5+SUM($D$6:$D$52,$D$59:$D$105,$D$112:D152)-SUM($E$6:$E$52,$E$59:$E$105,$E$112:E152)))","v":" "},null,null,null,6,"Ausblenden"]
[null,null,null,null,null,null,136,{"$f":"IF(D153+E153=0,\" \",SUM($H$5+SUM($D$6:$D$52,$D$59:$D$105,$D$112:D153)-SUM($E$6:$E$52,$E$59:$E$105,$E$112:E153)))","v":" "},null,null,null,6,"Ausblenden"]
[null,null,null,null,null,null,137,{"$f":"IF(D154+E154=0,\" \",SUM($H$5+SUM($D$6:$D$52,$D$59:$D$105,$D$112:D154)-SUM($E$6:$E$52,$E$59:$E$105,$E$112:E154)))","v":" "},null,null,null,6,"Ausblenden"]
[null,null,null,null,null,null,138,{"$f":"IF(D155+E155=0,\" \",SUM($H$5+SUM($D$6:$D$52,$D$59:$D$105,$D$112:D155)-SUM($E$6:$E$52,$E$59:$E$105,$E$112:E155)))","v":" "},null,null,null,6,"Ausblenden"]
[null,null,null,null,null,null,139,{"$f":"IF(D156+E156=0,\" \",SUM($H$5+SUM($D$6:$D$52,$D$59:$D$105,$D$112:D156)-SUM($E$6:$E$52,$E$59:$E$105,$E$112:E156)))","v":" "},null,null,null,6,"Ausblenden"]
[null,null,null,null,null,null,140,{"$f":"IF(D157+E157=0,\" \",SUM($H$5+SUM($D$6:$D$52,$D$59:$D$105,$D$112:D157)-SUM($E$6:$E$52,$E$59:$E$105,$E$112:E157)))","v":" "},null,null,null,6,"Ausblenden"]
[null,null,null,null,null,null,141,{"$f":"IF(D158+E158=0,\" \",SUM($H$5+SUM($D$6:$D$52,$D$59:$D$105,$D$112:D158)-SUM($E$6:$E$52,$E$59:$E$105,$E$112:E158)))","v":" "},null,null,null,6,"Ausblenden"]
[null,"Total",null,{"$f":"SUM(D111:D158)","v":0},{"$f":"SUM(E111:E158)","v":0},null,null,{"$f":"$H$5+D159-E159","v":0},null,null,null,null,{"$f":"IF(SUM($L$112:$L$158)<282,\"Einblenden\",\"Ausblenden\")","v":"Ausblenden"}]
[null,null,null,null,null,null,null,null,null,null,null,null,"Einblenden"]

{"sheet":"Februar","index":2,"n_rows":159,"n_cols":13,"rows_kept":159,"cut":false,"hidden":false,"merged":[]}
[{"$f":"Januar!A1+31","v":"2023-02-01"}]
[]
["Datum:","Text","FIBU","Einnahmen","Ausgaben",{"$f":"Januar!F3","v":"?"},null,"Saldo"]
[]
[1,"Saldovortrag",null,null,null,null,null,{"$f":"SUM(Januar!H159)","v":0}]
[null,null,null,null,null,null,1,{"$f":"IF(D6+E6=0,\" \",SUM($H$5+SUM($D$6:D6)-SUM($E$6:E6)))","v":" "},null,null,null,null,"Einblenden"]
[null,null,null,null,null,null,2,{"$f":"IF(D7+E7=0,\" \",SUM($H$5+SUM($D$6:D7)-SUM($E$6:E7)))","v":" "},null,null,null,{"$f":"COUNTIF(A7:F7,\"\")","v":6},{"$f":"IF(L7<6,\"Einblenden\",\"Ausblenden\")","v":"Ausblenden"}]
[null,null,null,null,null,null,3,{"$f":"IF(D8+E8=0,\" \",SUM($H$5+SUM($D$6:D8)-SUM($E$6:E8)))","v":" "},null,null,null,{"$f":"COUNTIF(A8:F8,\"\")","v":6},{"$f":"IF(L8<6,\"Einblenden\",\"Ausblenden\")","v":"Ausblenden"}]
[null,null,null,null,null,null,4,{"$f":"IF(D9+E9=0,\" \",SUM($H$5+SUM($D$6:D9)-SUM($E$6:E9)))","v":" "},null,null,null,6,"Ausblenden"]
[null,null,null,null,null,null,5,{"$f":"IF(D10+E10=0,\" \",SUM($H$5+SUM($D$6:D10)-SUM($E$6:E10)))","v":" "},null,null,null,6,"Ausblenden"]
[null,null,null,null,null,null,6,{"$f":"IF(D11+E11=0,\" \",SUM($H$5+SUM($D$6:D11)-SUM($E$6:E11)))","v":" "},null,null,null,6,"Ausblenden"]
[null,null,null,null,null,null,7,{"$f":"IF(D12+E12=0,\" \",SUM($H$5+SUM($D$6:D12)-SUM($E$6:E12)))","v":" "},null,null,null,6,"Ausblenden"]
[null,null,null,null,null,null,8,{"$f":"IF(D13+E13=0,\" \",SUM($H$5+SUM($D$6:D13)-SUM($E$6:E13)))","v":" "},null,null,null,6,"Ausblenden"]
[null,null,null,null,null,null,9,{"$f":"IF(D14+E14=0,\" \",SUM($H$5+SUM($D$6:D14)-SUM($E$6:E14)))","v":" "},null,null,null,6,"Ausblenden"]
[null,null,null,null,null,null,10,{"$f":"IF(D15+E15=0,\" \",SUM($H$5+SUM($D$6:D15)-SUM($E$6:E15)))","v":" "},null,null,null,6,"Ausblenden"]
[null,null,null,null,null,null,11,{"$f":"IF(D16+E16=0,\" \",SUM($H$5+SUM($D$6:D16)-SUM($E$6:E16)))","v":" "},null,null,null,6,"Ausblenden"]
[null,null,null,null,null,null,12,{"$f":"IF(D17+E17=0,\" \",SUM($H$5+SUM($D$6:D17)-SUM($E$6:E17)))","v":" "},null,null,null,6,"Ausblenden"]
[null,null,null,null,null,null,13,{"$f":"IF(D18+E18=0,\" \",SUM($H$5+SUM($D$6:D18)-SUM($E$6:E18)))","v":" "},null,null,null,6,"Ausblenden"]
[null,null,null,null,null,null,14,{"$f":"IF(D19+E19=0,\" \",SUM($H$5+SUM($D$6:D19)-SUM($E$6:E19)))","v":" "},null,null,null,6,"Ausblenden"]
[null,null,null,null,null,null,15,{"$f":"IF(D20+E20=0,\" \",SUM($H$5+SUM($D$6:D20)-SUM($E$6:E20)))","v":" "},null,null,null,6,"Ausblenden"]
[null,null,null,null,null,null,16,{"$f":"IF(D21+E21=0,\" \",SUM($H$5+SUM($D$6:D21)-SUM($E$6:E21)))","v":" "},null,null,null,6,"Ausblenden"]
[null,null,null,null,null,null,17,{"$f":"IF(D22+E22=0,\" \",SUM($H$5+SUM($D$6:D22)-SUM($E$6:E22)))","v":" "},null,null,null,6,"Ausblenden"]
[null,null,null,null,null,null,18,{"$f":"IF(D23+E23=0,\" \",SUM($H$5+SUM($D$6:D23)-SUM($E$6:E23)))","v":" "},null,null,null,6,"Ausblenden"]
[null,null,null,null,null,null,19,{"$f":"IF(D24+E24=0,\" \",SUM($H$5+SUM($D$6:D24)-SUM($E$6:E24)))","v":" "},null,null,null,6,"Ausblenden"]
[null,null,null,null,null,null,20,{"$f":"IF(D25+E25=0,\" \",SUM($H$5+SUM($D$6:D25)-SUM($E$6:E25)))","v":" "},null,null,null,6,"Ausblenden"]
[null,null,null,null,null,null,21,{"$f":"IF(D26+E26=0,\" \",SUM($H$5+SUM($D$6:D26)-SUM($E$6:E26)))","v":" "},null,null,null,6,"Ausblenden"]
[null,null,null,null,null,null,22,{"$f":"IF(D27+E27=0,\" \",SUM($H$5+SUM($D$6:D27)-SUM($E$6:E27)))","v":" "},null,null,null,6,"Ausblenden"]
[null,null,null,null,null,null,23,{"$f":"IF(D28+E28=0,\" \",SUM($H$5+SUM($D$6:D28)-SUM($E$6:E28)))","v":" "},null,null,null,6,"Ausblenden"]
[null,null,null,null,null,null,24,{"$f":"IF(D29+E29=0,\" \",SUM($H$5+SUM($D$6:D29)-SUM($E$6:E29)))","v":" "},null,null,null,6,"Ausblenden"]
[null,null,null,null,null,null,25,{"$f":"IF(D30+E30=0,\" \",SUM($H$5+SUM($D$6:D30)-SUM($E$6:E30)))","v":" "},null,null,null,6,"Ausblenden"]
[null,null,null,null,null,null,26,{"$f":"IF(D31+E31=0,\" \",SUM($H$5+SUM($D$6:D31)-SUM($E$6:E31)))","v":" "},null,null,null,6,"Ausblenden"]
[null,null,null,null,null,null,27,{"$f":"IF(D32+E32=0,\" \",SUM($H$5+SUM($D$6:D32)-SUM($E$6:E32)))","v":" "},null,null,null,6,"Ausblenden"]
[null,null,null,null,null,null,28,{"$f":"IF(D33+E33=0,\" \",SUM($H$5+SUM($D$6:D33)-SUM($E$6:E33)))","v":" "},null,null,null,6,"Ausblenden"]
[null,null,null,null,null,null,29,{"$f":"IF(D34+E34=0,\" \",SUM($H$5+SUM($D$6:D34)-SUM($E$6:E34)))","v":" "},null,null,null,6,"Ausblenden"]
[null,null,null,null,null,null,30,{"$f":"IF(D35+E35=0,\" \",SUM($H$5+SUM($D$6:D35)-SUM($E$6:E35)))","v":" "},null,null,null,6,"Ausblenden"]
[null,null,null,null,null,null,31,{"$f":"IF(D36+E36=0,\" \",SUM($H$5+SUM($D$6:D36)-SUM($E$6:E36)))","v":" "},null,null,null,6,"Ausblenden"]
[null,null,null,null,null,null,32,{"$f":"IF(D37+E37=0,\" \",SUM($H$5+SUM($D$6:D37)-SUM($E$6:E37)))","v":" "},null,null,null,6,"Ausblenden"]
[null,null,null,null,null,null,33,{"$f":"IF(D38+E38=0,\" \",SUM($H$5+SUM($D$6:D38)-SUM($E$6:E38)))","v":" "},null,null,null,6,"Ausblenden"]
[null,null,null,null,null,null,34,{"$f":"IF(D39+E39=0,\" \",SUM($H$5+SUM($D$6:D39)-SUM($E$6:E39)))","v":" "},null,null,null,6,"Ausblenden"]
[null,null,null,null,null,null,35,{"$f":"IF(D40+E40=0,\" \",SUM($H$5+SUM($D$6:D40)-SUM($E$6:E40)))","v":" "},null,null,null,6,"Ausblenden"]
[null,null,null,null,null,null,36,{"$f":"IF(D41+E41=0,\" \",SUM($H$5+SUM($D$6:D41)-SUM($E$6:E41)))","v":" "},null,null,null,6,"Ausblenden"]
[null,null,null,null,null,null,37,{"$f":"IF(D42+E42=0,\" \",SUM($H$5+SUM($D$6:D42)-SUM($E$6:E42)))","v":" "},null,null,null,6,"Ausblenden"]
[null,null,null,null,null,null,38,{"$f":"IF(D43+E43=0,\" \",SUM($H$5+SUM($D$6:D43)-SUM($E$6:E43)))","v":" "},null,null,null,6,"Ausblenden"]
[null,null,null,null,null,null,39,{"$f":"IF(D44+E44=0,\" \",SUM($H$5+SUM($D$6:D44)-SUM($E$6:E44)))","v":" "},null,null,null,6,"Ausblenden"]
[null,null,null,null,null,null,40,{"$f":"IF(D45+E45=0,\" \",SUM($H$5+SUM($D$6:D45)-SUM($E$6:E45)))","v":" "},null,null,null,6,"Ausblenden"]
[null,null,null,null,null,null,41,{"$f":"IF(D46+E46=0,\" \",SUM($H$5+SUM($D$6:D46)-SUM($E$6:E46)))","v":" "},null,null,null,6,"Ausblenden"]
[null,null,null,null,null,null,42,{"$f":"IF(D47+E47=0,\" \",SUM($H$5+SUM($D$6:D47)-SUM($E$6:E47)))","v":" "},null,null,null,6,"Ausblenden"]
[null,null,null,null,null,null,43,{"$f":"IF(D48+E48=0,\" \",SUM($H$5+SUM($D$6:D48)-SUM($E$6:E48)))","v":" "},null,null,null,6,"Ausblenden"]
[null,null,null,null,null,null,44,{"$f":"IF(D49+E49=0,\" \",SUM($H$5+SUM($D$6:D49)-SUM($E$6:E49)))","v":" "},null,null,null,6,"Ausblenden"]
[null,null,null,null,null,null,45,{"$f":"IF(D50+E50=0,\" \",SUM($H$5+SUM($D$6:D50)-SUM($E$6:E50)))","v":" "},null,null,null,6,"Ausblenden"]
[null,null,null,null,null,null,46,{"$f":"IF(D51+E51=0,\" \",SUM($H$5+SUM($D$6:D51)-SUM($E$6:E51)))","v":" "},null,null,null,6,"Ausblenden"]
[null,null,null,null,null,null,47,{"$f":"IF(D52+E52=0,\" \",SUM($H$5+SUM($D$6:D52)-SUM($E$6:E52)))","v":" "},null,null,null,6,"Ausblenden"]
[null,{"$f":"IF(SUM(D59:E105)<>0,\"Uebertrag\",\"Total\")","v":"Total"},null,{"$f":"SUM(D5:D52)","v":0},{"$f":"SUM(E5:E52)","v":0},null,null,{"$f":"H5+D53-E53","v":0},null,null,null,null,"Einblenden"]
[{"$f":"A1","v":"2023-02-01"},null,null,null,null,null,null,"Seite 2",null,null,null,null,{"$f":"IF(SUM($L$59:$L$105)<282,\"Einblenden\",\"Ausblenden\")","v":"Ausblenden"}]
[null,null,null,null,null,null,null,null,null,null,null,null,{"$f":"IF(SUM($L$59:$L$105)<282,\"Einblenden\",\"Ausblenden\")","v":"Ausblenden"}]
["Datum:","Text","FIBU","Einnahmen","Ausgaben",{"$f":"F3","v":"?"},null,"Saldo",null,null,null,null,{"$f":"IF(SUM($L$59:$L$105)<282,\"Einblenden\",\"Ausblenden\")","v":"Ausblenden"}]
[null,null,null,null,null,null,null,null,null,null,null,null,{"$f":"IF(SUM($L$59:$L$105)<282,\"Einblenden\",\"Ausblenden\")","v":"Ausblenden"}]
[null,"Uebertrag",null,{"$f":"D53","v":0},{"$f":"E53","v":0},null,null,{"$f":"H53","v":0},null,null,null,null,{"$f":"IF(SUM($L$59:$L$105)<282,\"Einblenden\",\"Ausblenden\")","v":"Ausblenden"}]
[null,null,null,null,null,null,48,{"$f":"IF(D59+E59=0,\" \",SUM($H$5+SUM($D$6:$D$52,$D$59:D59)-SUM($E$6:$E$52,$E$59:E59)))","v":" "},null,null,null,{"$f":"COUNTIF(A59:F59,\"\")","v":6},{"$f":"IF(L59<6,\"Einblenden\",\"Ausblenden\")","v":"Ausblenden"}]
[null,null,null,null,null,null,49,{"$f":"IF(D60+E60=0,\" \",SUM($H$5+SUM($D$6:$D$52,$D$59:D60)-SUM($E$6:$E$52,$E$59:E60)))","v":" "},null,null,null,{"$f":"COUNTIF(A60:F60,\"\")","v":6},{"$f":"IF(L60<6,\"Einblenden\",\"Ausblenden\")","v":"Ausblenden"}]
[null,null,null,null,null,null,50,{"$f":"IF(D61+E61=0,\" \",SUM($H$5+SUM($D$6:$D$52,$D$59:D61)-SUM($E$6:$E$52,$E$59:E61)))","v":" "},null,null,null,6,"Ausblenden"]
[null,null,null,null,null,null,51,{"$f":"IF(D62+E62=0,\" \",SUM($H$5+SUM($D$6:$D$52,$D$59:D62)-SUM($E$6:$E$52,$E$59:E62)))","v":" "},null,null,null,6,"Ausblenden"]
[null,null,null,null,null,null,52,{"$f":"IF(D63+E63=0,\" \",SUM($H$5+SUM($D$6:$D$52,$D$59:D63)-SUM($E$6:$E$52,$E$59:E63)))","v":" "},null,null,null,6,"Ausblenden"]
[null,null,null,null,null,null,53,{"$f":"IF(D64+E64=0,\" \",SUM($H$5+SUM($D$6:$D$52,$D$59:D64)-SUM($E$6:$E$52,$E$59:E64)))","v":" "},null,null,null,6,"Ausblenden"]
[null,null,null,null,null,null,54,{"$f":"IF(D65+E65=0,\" \",SUM($H$5+SUM($D$6:$D$52,$D$59:D65)-SUM($E$6:$E$52,$E$59:E65)))","v":" "},null,null,null,6,"Ausblenden"]
[null,null,null,null,null,null,55,{"$f":"IF(D66+E66=0,\" \",SUM($H$5+SUM($D$6:$D$52,$D$59:D66)-SUM($E$6:$E$52,$E$59:E66)))","v":" "},null,null,null,6,"Ausblenden"]
[null,null,null,null,null,null,56,{"$f":"IF(D67+E67=0,\" \",SUM($H$5+SUM($D$6:$D$52,$D$59:D67)-SUM($E$6:$E$52,$E$59:E67)))","v":" "},null,null,null,6,"Ausblenden"]
[null,null,null,null,null,null,57,{"$f":"IF(D68+E68=0,\" \",SUM($H$5+SUM($D$6:$D$52,$D$59:D68)-SUM($E$6:$E$52,$E$59:E68)))","v":" "},null,null,null,6,"Ausblenden"]
[null,null,null,null,null,null,58,{"$f":"IF(D69+E69=0,\" \",SUM($H$5+SUM($D$6:$D$52,$D$59:D69)-SUM($E$6:$E$52,$E$59:E69)))","v":" "},null,null,null,6,"Ausblenden"]
[null,null,null,null,null,null,59,{"$f":"IF(D70+E70=0,\" \",SUM($H$5+SUM($D$6:$D$52,$D$59:D70)-SUM($E$6:$E$52,$E$59:E70)))","v":" "},null,null,null,6,"Ausblenden"]
[null,null,null,null,null,null,60,{"$f":"IF(D71+E71=0,\" \",SUM($H$5+SUM($D$6:$D$52,$D$59:D71)-SUM($E$6:$E$52,$E$59:E71)))","v":" "},null,null,null,6,"Ausblenden"]
[null,null,null,null,null,null,61,{"$f":"IF(D72+E72=0,\" \",SUM($H$5+SUM($D$6:$D$52,$D$59:D72)-SUM($E$6:$E$52,$E$59:E72)))","v":" "},null,null,null,6,"Ausblenden"]
[null,null,null,null,null,null,62,{"$f":"IF(D73+E73=0,\" \",SUM($H$5+SUM($D$6:$D$52,$D$59:D73)-SUM($E$6:$E$52,$E$59:E73)))","v":" "},null,null,null,6,"Ausblenden"]
[null,null,null,null,null,null,63,{"$f":"IF(D74+E74=0,\" \",SUM($H$5+SUM($D$6:$D$52,$D$59:D74)-SUM($E$6:$E$52,$E$59:E74)))","v":" "},null,null,null,6,"Ausblenden"]
[null,null,null,null,null,null,64,{"$f":"IF(D75+E75=0,\" \",SUM($H$5+SUM($D$6:$D$52,$D$59:D75)-SUM($E$6:$E$52,$E$59:E75)))","v":" "},null,null,null,6,"Ausblenden"]
[null,null,null,null,null,null,65,{"$f":"IF(D76+E76=0,\" \",SUM($H$5+SUM($D$6:$D$52,$D$59:D76)-SUM($E$6:$E$52,$E$59:E76)))","v":" "},null,null,null,6,"Ausblenden"]
[null,null,null,null,null,null,66,{"$f":"IF(D77+E77=0,\" \",SUM($H$5+SUM($D$6:$D$52,$D$59:D77)-SUM($E$6:$E$52,$E$59:E77)))","v":" "},null,null,null,6,"Ausblenden"]
[null,null,null,null,null,null,67,{"$f":"IF(D78+E78=0,\" \",SUM($H$5+SUM($D$6:$D$52,$D$59:D78)-SUM($E$6:$E$52,$E$59:E78)))","v":" "},null,null,null,6,"Ausblenden"]
[null,null,null,null,null,null,68,{"$f":"IF(D79+E79=0,\" \",SUM($H$5+SUM($D$6:$D$52,$D$59:D79)-SUM($E$6:$E$52,$E$59:E79)))","v":" "},null,null,null,6,"Ausblenden"]
[null,null,null,null,null,null,69,{"$f":"IF(D80+E80=0,\" \",SUM($H$5+SUM($D$6:$D$52,$D$59:D80)-SUM($E$6:$E$52,$E$59:E80)))","v":" "},null,null,null,6,"Ausblenden"]
[null,null,null,null,null,null,70,{"$f":"IF(D81+E81=0,\" \",SUM($H$5+SUM($D$6:$D$52,$D$59:D81)-SUM($E$6:$E$52,$E$59:E81)))","v":" "},null,null,null,6,"Ausblenden"]
[null,null,null,null,null,null,71,{"$f":"IF(D82+E82=0,\" \",SUM($H$5+SUM($D$6:$D$52,$D$59:D82)-SUM($E$6:$E$52,$E$59:E82)))","v":" "},null,null,null,6,"Ausblenden"]
[null,null,null,null,null,null,72,{"$f":"IF(D83+E83=0,\" \",SUM($H$5+SUM($D$6:$D$52,$D$59:D83)-SUM($E$6:$E$52,$E$59:E83)))","v":" "},null,null,null,6,"Ausblenden"]
[null,null,null,null,null,null,73,{"$f":"IF(D84+E84=0,\" \",SUM($H$5+SUM($D$6:$D$52,$D$59:D84)-SUM($E$6:$E$52,$E$59:E84)))","v":" "},null,null,null,6,"Ausblenden"]
[null,null,null,null,null,null,74,{"$f":"IF(D85+E85=0,\" \",SUM($H$5+SUM($D$6:$D$52,$D$59:D85)-SUM($E$6:$E$52,$E$59:E85)))","v":" "},null,null,null,6,"Ausblenden"]
[null,null,null,null,null,null,75,{"$f":"IF(D86+E86=0,\" \",SUM($H$5+SUM($D$6:$D$52,$D$59:D86)-SUM($E$6:$E$52,$E$59:E86)))","v":" "},null,null,null,6,"Ausblenden"]
[null,null,null,null,null,null,76,{"$f":"IF(D87+E87=0,\" \",SUM($H$5+SUM($D$6:$D$52,$D$59:D87)-SUM($E$6:$E$52,$E$59:E87)))","v":" "},null,null,null,6,"Ausblenden"]
[null,null,null,null,null,null,77,{"$f":"IF(D88+E88=0,\" \",SUM($H$5+SUM($D$6:$D$52,$D$59:D88)-SUM($E$6:$E$52,$E$59:E88)))","v":" "},null,null,null,6,"Ausblenden"]
[null,null,null,null,null,null,78,{"$f":"IF(D89+E89=0,\" \",SUM($H$5+SUM($D$6:$D$52,$D$59:D89)-SUM($E$6:$E$52,$E$59:E89)))","v":" "},null,null,null,6,"Ausblenden"]
[null,null,null,null,null,null,79,{"$f":"IF(D90+E90=0,\" \",SUM($H$5+SUM($D$6:$D$52,$D$59:D90)-SUM($E$6:$E$52,$E$59:E90)))","v":" "},null,null,null,6,"Ausblenden"]
[null,null,null,null,null,null,80,{"$f":"IF(D91+E91=0,\" \",SUM($H$5+SUM($D$6:$D$52,$D$59:D91)-SUM($E$6:$E$52,$E$59:E91)))","v":" "},null,null,null,6,"Ausblenden"]
[null,null,null,null,null,null,81,{"$f":"IF(D92+E92=0,\" \",SUM($H$5+SUM($D$6:$D$52,$D$59:D92)-SUM($E$6:$E$52,$E$59:E92)))","v":" "},null,null,null,6,"Ausblenden"]
[null,null,null,null,null,null,82,{"$f":"IF(D93+E93=0,\" \",SUM($H$5+SUM($D$6:$D$52,$D$59:D93)-SUM($E$6:$E$52,$E$59:E93)))","v":" "},null,null,null,6,"Ausblenden"]
[null,null,null,null,null,null,83,{"$f":"IF(D94+E94=0,\" \",SUM($H$5+SUM($D$6:$D$52,$D$59:D94)-SUM($E$6:$E$52,$E$59:E94)))","v":" "},null,null,null,6,"Ausblenden"]
[null,null,null,null,null,null,84,{"$f":"IF(D95+E95=0,\" \",SUM($H$5+SUM($D$6:$D$52,$D$59:D95)-SUM($E$6:$E$52,$E$59:E95)))","v":" "},null,null,null,6,"Ausblenden"]
[null,null,null,null,null,null,85,{"$f":"IF(D96+E96=0,\" \",SUM($H$5+SUM($D$6:$D$52,$D$59:D96)-SUM($E$6:$E$52,$E$59:E96)))","v":" "},null,null,null,6,"Ausblenden"]
[null,null,null,null,null,null,86,{"$f":"IF(D97+E97=0,\" \",SUM($H$5+SUM($D$6:$D$52,$D$59:D97)-SUM($E$6:$E$52,$E$59:E97)))","v":" "},null,null,null,6,"Ausblenden"]
[null,null,null,null,null,null,87,{"$f":"IF(D98+E98=0,\" \",SUM($H$5+SUM($D$6:$D$52,$D$59:D98)-SUM($E$6:$E$52,$E$59:E98)))","v":" "},null,null,null,6,"Ausblenden"]
[null,null,null,null,null,null,88,{"$f":"IF(D99+E99=0,\" \",SUM($H$5+SUM($D$6:$D$52,$D$59:D99)-SUM($E$6:$E$52,$E$59:E99)))","v":" "},null,null,null,6,"Ausblenden"]
[null,null,null,null,null,null,89,{"$f":"IF(D100+E100=0,\" \",SUM($H$5+SUM($D$6:$D$52,$D$59:D100)-SUM($E$6:$E$52,$E$59:E100)))","v":" "},null,null,null,6,"Ausblenden"]
[null,null,null,null,null,null,90,{"$f":"IF(D101+E101=0,\" \",SUM($H$5+SUM($D$6:$D$52,$D$59:D101)-SUM($E$6:$E$52,$E$59:E101)))","v":" "},null,null,null,6,"Ausblenden"]
[null,null,null,null,null,null,91,{"$f":"IF(D102+E102=0,\" \",SUM($H$5+SUM($D$6:$D$52,$D$59:D102)-SUM($E$6:$E$52,$E$59:E102)))","v":" "},null,null,null,6,"Ausblenden"]
[null,null,null,null,null,null,92,{"$f":"IF(D103+E103=0,\" \",SUM($H$5+SUM($D$6:$D$52,$D$59:D103)-SUM($E$6:$E$52,$E$59:E103)))","v":" "},null,null,null,6,"Ausblenden"]
[null,null,null,null,null,null,93,{"$f":"IF(D104+E104=0,\" \",SUM($H$5+SUM($D$6:$D$52,$D$59:D104)-SUM($E$6:$E$52,$E$59:E104)))","v":" "},null,null,null,6,"Ausblenden"]
[null,null,null,null,null,null,94,{"$f":"IF(D105+E105=0,\" \",SUM($H$5+SUM($D$6:$D$52,$D$59:D105)-SUM($E$6:$E$52,$E$59:E105)))","v":" "},null,null,null,{"$f":"COUNTIF(A105:F105,\"\")","v":6},"Ausblenden"]
[null,{"$f":"IF(SUM(D112:E158)<>0,\"Uebertrag\",\"Total\")","v":"Total"},null,{"$f":"SUM(D58:D105)","v":0},{"$f":"SUM(E58:E105)","v":0},null,null,{"$f":"$H$5+D106-E106","v":0},null,null,null,null,{"$f":"IF(SUM($L$59:$L$105)<282,\"Einblenden\",\"Ausblenden\")","v":"Ausblenden"}]
[{"$f":"A1","v":"2023-02-01"},null,null,null,null,null,null,"Seite 3",null,null,null,null,{"$f":"IF(SUM($L$112:$L$158)<282,\"Einblenden\",\"Ausblenden\")","v":"Ausblenden"}]
[null,null,null,null,null,null,null,null,null,null,null,null,{"$f":"IF(SUM($L$112:$L$158)<282,\"Einblenden\",\"Ausblenden\")","v":"Ausblenden"}]
["Datum:","Text","FIBU","Einnahmen","Ausgaben",{"$f":"F3","v":"?"},null,"Saldo",null,null,null,null,{"$f":"IF(SUM($L$112:$L$158)<282,\"Einblenden\",\"Ausblenden\")","v":"Ausblenden"}]
[null,null,null,null,null,null,null,null,null,null,null,null,{"$f":"IF(SUM($L$112:$L$158)<282,\"Einblenden\",\"Ausblenden\")","v":"Ausblenden"}]
[null,"Uebertrag",null,{"$f":"D106","v":0},{"$f":"E106","v":0},null,null,{"$f":"H106","v":0},null,null,null,null,{"$f":"IF(SUM($L$112:$L$158)<282,\"Einblenden\",\"Ausblenden\")","v":"Ausblenden"}]
[null,null,null,null,null,null,95,{"$f":"IF(D112+E112=0,\" \",SUM($H$5+SUM($D$6:$D$52,$D$59:$D$105,$D$112:D112)-SUM($E$6:$E$52,$E$59:$E$105,$E$112:E112)))","v":" "},null,null,null,{"$f":"COUNTIF(A112:F112,\"\")","v":6},{"$f":"IF(L112<6,\"Einblenden\",\"Ausblenden\")","v":"Ausblenden"}]
[null,null,null,null,null,null,96,{"$f":"IF(D113+E113=0,\" \",SUM($H$5+SUM($D$6:$D$52,$D$59:$D$105,$D$112:D113)-SUM($E$6:$E$52,$E$59:$E$105,$E$112:E113)))","v":" "},null,null,null,{"$f":"COUNTIF(A113:F113,\"\")","v":6},"Ausblenden"]
[null,null,null,null,null,null,97,{"$f":"IF(D114+E114=0,\" \",SUM($H$5+SUM($D$6:$D$52,$D$59:$D$105,$D$112:D114)-SUM($E$6:$E$52,$E$59:$E$105,$E$112:E114)))","v":" "},null,null,null,6,"Ausblenden"]
[null,null,null,null,null,null,98,{"$f":"IF(D115+E115=0,\" \",SUM($H$5+SUM($D$6:$D$52,$D$59:$D$105,$D$112:D115)-SUM($E$6:$E$52,$E$59:$E$105,$E$112:E115)))","v":" "},null,null,null,6,"Ausblenden"]
[null,null,null,null,null,null,99,{"$f":"IF(D116+E116=0,\" \",SUM($H$5+SUM($D$6:$D$52,$D$59:$D$105,$D$112:D116)-SUM($E$6:$E$52,$E$59:$E$105,$E$112:E116)))","v":" "},null,null,null,6,"Ausblenden"]
[null,null,null,null,null,null,100,{"$f":"IF(D117+E117=0,\" \",SUM($H$5+SUM($D$6:$D$52,$D$59:$D$105,$D$112:D117)-SUM($E$6:$E$52,$E$59:$E$105,$E$112:E117)))","v":" "},null,null,null,6,"Ausblenden"]
[null,null,null,null,null,null,101,{"$f":"IF(D118+E118=0,\" \",SUM($H$5+SUM($D$6:$D$52,$D$59:$D$105,$D$112:D118)-SUM($E$6:$E$52,$E$59:$E$105,$E$112:E118)))","v":" "},null,null,null,6,"Ausblenden"]
[null,null,null,null,null,null,102,{"$f":"IF(D119+E119=0,\" \",SUM($H$5+SUM($D$6:$D$52,$D$59:$D$105,$D$112:D119)-SUM($E$6:$E$52,$E$59:$E$105,$E$112:E119)))","v":" "},null,null,null,6,"Ausblenden"]
[null,null,null,null,null,null,103,{"$f":"IF(D120+E120=0,\" \",SUM($H$5+SUM($D$6:$D$52,$D$59:$D$105,$D$112:D120)-SUM($E$6:$E$52,$E$59:$E$105,$E$112:E120)))","v":" "},null,null,null,6,"Ausblenden"]
[null,null,null,null,null,null,104,{"$f":"IF(D121+E121=0,\" \",SUM($H$5+SUM($D$6:$D$52,$D$59:$D$105,$D$112:D121)-SUM($E$6:$E$52,$E$59:$E$105,$E$112:E121)))","v":" "},null,null,null,6,"Ausblenden"]
[null,null,null,null,null,null,105,{"$f":"IF(D122+E122=0,\" \",SUM($H$5+SUM($D$6:$D$52,$D$59:$D$105,$D$112:D122)-SUM($E$6:$E$52,$E$59:$E$105,$E$112:E122)))","v":" "},null,null,null,6,"Ausblenden"]
[null,null,null,null,null,null,106,{"$f":"IF(D123+E123=0,\" \",SUM($H$5+SUM($D$6:$D$52,$D$59:$D$105,$D$112:D123)-SUM($E$6:$E$52,$E$59:$E$105,$E$112:E123)))","v":" "},null,null,null,6,"Ausblenden"]
[null,null,null,null,null,null,107,{"$f":"IF(D124+E124=0,\" \",SUM($H$5+SUM($D$6:$D$52,$D$59:$D$105,$D$112:D124)-SUM($E$6:$E$52,$E$59:$E$105,$E$112:E124)))","v":" "},null,null,null,6,"Ausblenden"]
[null,null,null,null,null,null,108,{"$f":"IF(D125+E125=0,\" \",SUM($H$5+SUM($D$6:$D$52,$D$59:$D$105,$D$112:D125)-SUM($E$6:$E$52,$E$59:$E$105,$E$112:E125)))","v":" "},null,null,null,6,"Ausblenden"]
[null,null,null,null,null,null,109,{"$f":"IF(D126+E126=0,\" \",SUM($H$5+SUM($D$6:$D$52,$D$59:$D$105,$D$112:D126)-SUM($E$6:$E$52,$E$59:$E$105,$E$112:E126)))","v":" "},null,null,null,6,"Ausblenden"]
[null,null,null,null,null,null,110,{"$f":"IF(D127+E127=0,\" \",SUM($H$5+SUM($D$6:$D$52,$D$59:$D$105,$D$112:D127)-SUM($E$6:$E$52,$E$59:$E$105,$E$112:E127)))","v":" "},null,null,null,6,"Ausblenden"]
[null,null,null,null,null,null,111,{"$f":"IF(D128+E128=0,\" \",SUM($H$5+SUM($D$6:$D$52,$D$59:$D$105,$D$112:D128)-SUM($E$6:$E$52,$E$59:$E$105,$E$112:E128)))","v":" "},null,null,null,6,"Ausblenden"]
[null,null,null,null,null,null,112,{"$f":"IF(D129+E129=0,\" \",SUM($H$5+SUM($D$6:$D$52,$D$59:$D$105,$D$112:D129)-SUM($E$6:$E$52,$E$59:$E$105,$E$112:E129)))","v":" "},null,null,null,6,"Ausblenden"]
[null,null,null,null,null,null,113,{"$f":"IF(D130+E130=0,\" \",SUM($H$5+SUM($D$6:$D$52,$D$59:$D$105,$D$112:D130)-SUM($E$6:$E$52,$E$59:$E$105,$E$112:E130)))","v":" "},null,null,null,6,"Ausblenden"]
[null,null,null,null,null,null,114,{"$f":"IF(D131+E131=0,\" \",SUM($H$5+SUM($D$6:$D$52,$D$59:$D$105,$D$112:D131)-SUM($E$6:$E$52,$E$59:$E$105,$E$112:E131)))","v":" "},null,null,null,6,"Ausblenden"]
[null,null,null,null,null,null,115,{"$f":"IF(D132+E132=0,\" \",SUM($H$5+SUM($D$6:$D$52,$D$59:$D$105,$D$112:D132)-SUM($E$6:$E$52,$E$59:$E$105,$E$112:E132)))","v":" "},null,null,null,6,"Ausblenden"]
[null,null,null,null,null,null,116,{"$f":"IF(D133+E133=0,\" \",SUM($H$5+SUM($D$6:$D$52,$D$59:$D$105,$D$112:D133)-SUM($E$6:$E$52,$E$59:$E$105,$E$112:E133)))","v":" "},null,null,null,6,"Ausblenden"]
[null,null,null,null,null,null,117,{"$f":"IF(D134+E134=0,\" \",SUM($H$5+SUM($D$6:$D$52,$D$59:$D$105,$D$112:D134)-SUM($E$6:$E$52,$E$59:$E$105,$E$112:E134)))","v":" "},null,null,null,6,"Ausblenden"]
[null,null,null,null,null,null,118,{"$f":"IF(D135+E135=0,\" \",SUM($H$5+SUM($D$6:$D$52,$D$59:$D$105,$D$112:D135)-SUM($E$6:$E$52,$E$59:$E$105,$E$112:E135)))","v":" "},null,null,null,6,"Ausblenden"]
[null,null,null,null,null,null,119,{"$f":"IF(D136+E136=0,\" \",SUM($H$5+SUM($D$6:$D$52,$D$59:$D$105,$D$112:D136)-SUM($E$6:$E$52,$E$59:$E$105,$E$112:E136)))","v":" "},null,null,null,6,"Ausblenden"]
[null,null,null,null,null,null,120,{"$f":"IF(D137+E137=0,\" \",SUM($H$5+SUM($D$6:$D$52,$D$59:$D$105,$D$112:D137)-SUM($E$6:$E$52,$E$59:$E$105,$E$112:E137)))","v":" "},null,null,null,6,"Ausblenden"]
[null,null,null,null,null,null,121,{"$f":"IF(D138+E138=0,\" \",SUM($H$5+SUM($D$6:$D$52,$D$59:$D$105,$D$112:D138)-SUM($E$6:$E$52,$E$59:$E$105,$E$112:E138)))","v":" "},null,null,null,6,"Ausblenden"]
[null,null,null,null,null,null,122,{"$f":"IF(D139+E139=0,\" \",SUM($H$5+SUM($D$6:$D$52,$D$59:$D$105,$D$112:D139)-SUM($E$6:$E$52,$E$59:$E$105,$E$112:E139)))","v":" "},null,null,null,6,"Ausblenden"]
[null,null,null,null,null,null,123,{"$f":"IF(D140+E140=0,\" \",SUM($H$5+SUM($D$6:$D$52,$D$59:$D$105,$D$112:D140)-SUM($E$6:$E$52,$E$59:$E$105,$E$112:E140)))","v":" "},null,null,null,6,"Ausblenden"]
[null,null,null,null,null,null,124,{"$f":"IF(D141+E141=0,\" \",SUM($H$5+SUM($D$6:$D$52,$D$59:$D$105,$D$112:D141)-SUM($E$6:$E$52,$E$59:$E$105,$E$112:E141)))","v":" "},null,null,null,6,"Ausblenden"]
[null,null,null,null,null,null,125,{"$f":"IF(D142+E142=0,\" \",SUM($H$5+SUM($D$6:$D$52,$D$59:$D$105,$D$112:D142)-SUM($E$6:$E$52,$E$59:$E$105,$E$112:E142)))","v":" "},null,null,null,6,"Ausblenden"]
[null,null,null,null,null,null,126,{"$f":"IF(D143+E143=0,\" \",SUM($H$5+SUM($D$6:$D$52,$D$59:$D$105,$D$112:D143)-SUM($E$6:$E$52,$E$59:$E$105,$E$112:E143)))","v":" "},null,null,null,6,"Ausblenden"]
[null,null,null,null,null,null,127,{"$f":"IF(D144+E144=0,\" \",SUM($H$5+SUM($D$6:$D$52,$D$59:$D$105,$D$112:D144)-SUM($E$6:$E$52,$E$59:$E$105,$E$112:E144)))","v":" "},null,null,null,6,"Ausblenden"]
[null,null,null,null,null,null,128,{"$f":"IF(D145+E145=0,\" \",SUM($H$5+SUM($D$6:$D$52,$D$59:$D$105,$D$112:D145)-SUM($E$6:$E$52,$E$59:$E$105,$E$112:E145)))","v":" "},null,null,null,6,"Ausblenden"]
[null,null,null,null,null,null,129,{"$f":"IF(D146+E146=0,\" \",SUM($H$5+SUM($D$6:$D$52,$D$59:$D$105,$D$112:D146)-SUM($E$6:$E$52,$E$59:$E$105,$E$112:E146)))","v":" "},null,null,null,6,"Ausblenden"]
[null,null,null,null,null,null,130,{"$f":"IF(D147+E147=0,\" \",SUM($H$5+SUM($D$6:$D$52,$D$59:$D$105,$D$112:D147)-SUM($E$6:$E$52,$E$59:$E$105,$E$112:E147)))","v":" "},null,null,null,6,"Ausblenden"]
[null,null,null,null,null,null,131,{"$f":"IF(D148+E148=0,\" \",SUM($H$5+SUM($D$6:$D$52,$D$59:$D$105,$D$112:D148)-SUM($E$6:$E$52,$E$59:$E$105,$E$112:E148)))","v":" "},null,null,null,6,"Ausblenden"]
[null,null,null,null,null,null,132,{"$f":"IF(D149+E149=0,\" \",SUM($H$5+SUM($D$6:$D$52,$D$59:$D$105,$D$112:D149)-SUM($E$6:$E$52,$E$59:$E$105,$E$112:E149)))","v":" "},null,null,null,6,"Ausblenden"]
[null,null,null,null,null,null,133,{"$f":"IF(D150+E150=0,\" \",SUM($H$5+SUM($D$6:$D$52,$D$59:$D$105,$D$112:D150)-SUM($E$6:$E$52,$E$59:$E$105,$E$112:E150)))","v":" "},null,null,null,6,"Ausblenden"]
[null,null,null,null,null,null,134,{"$f":"IF(D151+E151=0,\" \",SUM($H$5+SUM($D$6:$D$52,$D$59:$D$105,$D$112:D151)-SUM($E$6:$E$52,$E$59:$E$105,$E$112:E151)))","v":" "},null,null,null,6,"Ausblenden"]
[null,null,null,null,null,null,135,{"$f":"IF(D152+E152=0,\" \",SUM($H$5+SUM($D$6:$D$52,$D$59:$D$105,$D$112:D152)-SUM($E$6:$E$52,$E$59:$E$105,$E$112:E152)))","v":" "},null,null,null,6,"Ausblenden"]
[null,null,null,null,null,null,136,{"$f":"IF(D153+E153=0,\" \",SUM($H$5+SUM($D$6:$D$52,$D$59:$D$105,$D$112:D153)-SUM($E$6:$E$52,$E$59:$E$105,$E$112:E153)))","v":" "},null,null,null,6,"Ausblenden"]
[null,null,null,null,null,null,137,{"$f":"IF(D154+E154=0,\" \",SUM($H$5+SUM($D$6:$D$52,$D$59:$D$105,$D$112:D154)-SUM($E$6:$E$52,$E$59:$E$105,$E$112:E154)))","v":" "},null,null,null,6,"Ausblenden"]
[null,null,null,null,null,null,138,{"$f":"IF(D155+E155=0,\" \",SUM($H$5+SUM($D$6:$D$52,$D$59:$D$105,$D$112:D155)-SUM($E$6:$E$52,$E$59:$E$105,$E$112:E155)))","v":" "},null,null,null,6,"Ausblenden"]
[null,null,null,null,null,null,139,{"$f":"IF(D156+E156=0,\" \",SUM($H$5+SUM($D$6:$D$52,$D$59:$D$105,$D$112:D156)-SUM($E$6:$E$52,$E$59:$E$105,$E$112:E156)))","v":" "},null,null,null,6,"Ausblenden"]
[null,null,null,null,null,null,140,{"$f":"IF(D157+E157=0,\" \",SUM($H$5+SUM($D$6:$D$52,$D$59:$D$105,$D$112:D157)-SUM($E$6:$E$52,$E$59:$E$105,$E$112:E157)))","v":" "},null,null,null,6,"Ausblenden"]
[null,null,null,null,null,null,141,{"$f":"IF(D158+E158=0,\" \",SUM($H$5+SUM($D$6:$D$52,$D$59:$D$105,$D$112:D158)-SUM($E$6:$E$52,$E$59:$E$105,$E$112:E158)))","v":" "},null,null,null,6,"Ausblenden"]
[null,"Total",null,{"$f":"SUM(D111:D158)","v":0},{"$f":"SUM(E111:E158)","v":0},null,null,{"$f":"$H$5+D159-E159","v":0},null,null,null,null,{"$f":"IF(SUM($L$112:$L$158)<282,\"Einblenden\",\"Ausblenden\")","v":"Ausblenden"}]

{"sheet":"März","index":3,"n_rows":159,"n_cols":13,"rows_kept":159,"cut":false,"hidden":false,"merged":[]}
[{"$f":"Februar!A1+31","v":"2023-03-04"}]
[]
["Datum:","Text","FIBU","Einnahmen","Ausgaben",{"$f":"Januar!F3","v":"?"},null,"Saldo"]
[]
[1,"Saldovortrag",null,null,null,null,null,{"$f":"SUM(Februar!H159)","v":0}]
[null,null,null,null,null,null,1,{"$f":"IF(D6+E6=0,\" \",SUM($H$5+SUM($D$6:D6)-SUM($E$6:E6)))","v":" "},null,null,null,null,"Einblenden"]
[null,null,null,null,null,null,2,{"$f":"IF(D7+E7=0,\" \",SUM($H$5+SUM($D$6:D7)-SUM($E$6:E7)))","v":" "},null,null,null,{"$f":"COUNTIF(A7:F7,\"\")","v":6},{"$f":"IF(L7<6,\"Einblenden\",\"Ausblenden\")","v":"Ausblenden"}]
[null,null,null,null,null,null,3,{"$f":"IF(D8+E8=0,\" \",SUM($H$5+SUM($D$6:D8)-SUM($E$6:E8)))","v":" "},null,null,null,{"$f":"COUNTIF(A8:F8,\"\")","v":6},{"$f":"IF(L8<6,\"Einblenden\",\"Ausblenden\")","v":"Ausblenden"}]
[null,null,null,null,null,null,4,{"$f":"IF(D9+E9=0,\" \",SUM($H$5+SUM($D$6:D9)-SUM($E$6:E9)))","v":" "},null,null,null,6,"Ausblenden"]
[null,null,null,null,null,null,5,{"$f":"IF(D10+E10=0,\" \",SUM($H$5+SUM($D$6:D10)-SUM($E$6:E10)))","v":" "},null,null,null,6,"Ausblenden"]
[null,null,null,null,null,null,6,{"$f":"IF(D11+E11=0,\" \",SUM($H$5+SUM($D$6:D11)-SUM($E$6:E11)))","v":" "},null,null,null,6,"Ausblenden"]
[null,null,null,null,null,null,7,{"$f":"IF(D12+E12=0,\" \",SUM($H$5+SUM($D$6:D12)-SUM($E$6:E12)))","v":" "},null,null,null,6,"Ausblenden"]
[null,null,null,null,null,null,8,{"$f":"IF(D13+E13=0,\" \",SUM($H$5+SUM($D$6:D13)-SUM($E$6:E13)))","v":" "},null,null,null,6,"Ausblenden"]
[null,null,null,null,null,null,9,{"$f":"IF(D14+E14=0,\" \",SUM($H$5+SUM($D$6:D14)-SUM($E$6:E14)))","v":" "},null,null,null,6,"Ausblenden"]
[null,null,null,null,null,null,10,{"$f":"IF(D15+E15=0,\" \",SUM($H$5+SUM($D$6:D15)-SUM($E$6:E15)))","v":" "},null,null,null,6,"Ausblenden"]
[null,null,null,null,null,null,11,{"$f":"IF(D16+E16=0,\" \",SUM($H$5+SUM($D$6:D16)-SUM($E$6:E16)))","v":" "},null,null,null,6,"Ausblenden"]
[null,null,null,null,null,null,12,{"$f":"IF(D17+E17=0,\" \",SUM($H$5+SUM($D$6:D17)-SUM($E$6:E17)))","v":" "},null,null,null,6,"Ausblenden"]
[null,null,null,null,null,null,13,{"$f":"IF(D18+E18=0,\" \",SUM($H$5+SUM($D$6:D18)-SUM($E$6:E18)))","v":" "},null,null,null,6,"Ausblenden"]
[null,null,null,null,null,null,14,{"$f":"IF(D19+E19=0,\" \",SUM($H$5+SUM($D$6:D19)-SUM($E$6:E19)))","v":" "},null,null,null,6,"Ausblenden"]
[null,null,null,null,null,null,15,{"$f":"IF(D20+E20=0,\" \",SUM($H$5+SUM($D$6:D20)-SUM($E$6:E20)))","v":" "},null,null,null,6,"Ausblenden"]
[null,null,null,null,null,null,16,{"$f":"IF(D21+E21=0,\" \",SUM($H$5+SUM($D$6:D21)-SUM($E$6:E21)))","v":" "},null,null,null,6,"Ausblenden"]
[null,null,null,null,null,null,17,{"$f":"IF(D22+E22=0,\" \",SUM($H$5+SUM($D$6:D22)-SUM($E$6:E22)))","v":" "},null,null,null,6,"Ausblenden"]
[null,null,null,null,null,null,18,{"$f":"IF(D23+E23=0,\" \",SUM($H$5+SUM($D$6:D23)-SUM($E$6:E23)))","v":" "},null,null,null,6,"Ausblenden"]
[null,null,null,null,null,null,19,{"$f":"IF(D24+E24=0,\" \",SUM($H$5+SUM($D$6:D24)-SUM($E$6:E24)))","v":" "},null,null,null,6,"Ausblenden"]
[null,null,null,null,null,null,20,{"$f":"IF(D25+E25=0,\" \",SUM($H$5+SUM($D$6:D25)-SUM($E$6:E25)))","v":" "},null,null,null,6,"Ausblenden"]
[null,null,null,null,null,null,21,{"$f":"IF(D26+E26=0,\" \",SUM($H$5+SUM($D$6:D26)-SUM($E$6:E26)))","v":" "},null,null,null,6,"Ausblenden"]
[null,null,null,null,null,null,22,{"$f":"IF(D27+E27=0,\" \",SUM($H$5+SUM($D$6:D27)-SUM($E$6:E27)))","v":" "},null,null,null,6,"Ausblenden"]
[null,null,null,null,null,null,23,{"$f":"IF(D28+E28=0,\" \",SUM($H$5+SUM($D$6:D28)-SUM($E$6:E28)))","v":" "},null,null,null,6,"Ausblenden"]
[null,null,null,null,null,null,24,{"$f":"IF(D29+E29=0,\" \",SUM($H$5+SUM($D$6:D29)-SUM($E$6:E29)))","v":" "},null,null,null,6,"Ausblenden"]
[null,null,null,null,null,null,25,{"$f":"IF(D30+E30=0,\" \",SUM($H$5+SUM($D$6:D30)-SUM($E$6:E30)))","v":" "},null,null,null,6,"Ausblenden"]
[null,null,null,null,null,null,26,{"$f":"IF(D31+E31=0,\" \",SUM($H$5+SUM($D$6:D31)-SUM($E$6:E31)))","v":" "},null,null,null,6,"Ausblenden"]
[null,null,null,null,null,null,27,{"$f":"IF(D32+E32=0,\" \",SUM($H$5+SUM($D$6:D32)-SUM($E$6:E32)))","v":" "},null,null,null,6,"Ausblenden"]
[null,null,null,null,null,null,28,{"$f":"IF(D33+E33=0,\" \",SUM($H$5+SUM($D$6:D33)-SUM($E$6:E33)))","v":" "},null,null,null,6,"Ausblenden"]
[null,null,null,null,null,null,29,{"$f":"IF(D34+E34=0,\" \",SUM($H$5+SUM($D$6:D34)-SUM($E$6:E34)))","v":" "},null,null,null,6,"Ausblenden"]
[null,null,null,null,null,null,30,{"$f":"IF(D35+E35=0,\" \",SUM($H$5+SUM($D$6:D35)-SUM($E$6:E35)))","v":" "},null,null,null,6,"Ausblenden"]
[null,null,null,null,null,null,31,{"$f":"IF(D36+E36=0,\" \",SUM($H$5+SUM($D$6:D36)-SUM($E$6:E36)))","v":" "},null,null,null,6,"Ausblenden"]
[null,null,null,null,null,null,32,{"$f":"IF(D37+E37=0,\" \",SUM($H$5+SUM($D$6:D37)-SUM($E$6:E37)))","v":" "},null,null,null,6,"Ausblenden"]
[null,null,null,null,null,null,33,{"$f":"IF(D38+E38=0,\" \",SUM($H$5+SUM($D$6:D38)-SUM($E$6:E38)))","v":" "},null,null,null,6,"Ausblenden"]
[null,null,null,null,null,null,34,{"$f":"IF(D39+E39=0,\" \",SUM($H$5+SUM($D$6:D39)-SUM($E$6:E39)))","v":" "},null,null,null,6,"Ausblenden"]
[null,null,null,null,null,null,35,{"$f":"IF(D40+E40=0,\" \",SUM($H$5+SUM($D$6:D40)-SUM($E$6:E40)))","v":" "},null,null,null,6,"Ausblenden"]
[null,null,null,null,null,null,36,{"$f":"IF(D41+E41=0,\" \",SUM($H$5+SUM($D$6:D41)-SUM($E$6:E41)))","v":" "},null,null,null,6,"Ausblenden"]
[null,null,null,null,null,null,37,{"$f":"IF(D42+E42=0,\" \",SUM($H$5+SUM($D$6:D42)-SUM($E$6:E42)))","v":" "},null,null,null,6,"Ausblenden"]
[null,null,null,null,null,null,38,{"$f":"IF(D43+E43=0,\" \",SUM($H$5+SUM($D$6:D43)-SUM($E$6:E43)))","v":" "},null,null,null,6,"Ausblenden"]
[null,null,null,null,null,null,39,{"$f":"IF(D44+E44=0,\" \",SUM($H$5+SUM($D$6:D44)-SUM($E$6:E44)))","v":" "},null,null,null,6,"Ausblenden"]
[null,null,null,null,null,null,40,{"$f":"IF(D45+E45=0,\" \",SUM($H$5+SUM($D$6:D45)-SUM($E$6:E45)))","v":" "},null,null,null,6,"Ausblenden"]
[null,null,null,null,null,null,41,{"$f":"IF(D46+E46=0,\" \",SUM($H$5+SUM($D$6:D46)-SUM($E$6:E46)))","v":" "},null,null,null,6,"Ausblenden"]
[null,null,null,null,null,null,42,{"$f":"IF(D47+E47=0,\" \",SUM($H$5+SUM($D$6:D47)-SUM($E$6:E47)))","v":" "},null,null,null,6,"Ausblenden"]
[null,null,null,null,null,null,43,{"$f":"IF(D48+E48=0,\" \",SUM($H$5+SUM($D$6:D48)-SUM($E$6:E48)))","v":" "},null,null,null,6,"Ausblenden"]
[null,null,null,null,null,null,44,{"$f":"IF(D49+E49=0,\" \",SUM($H$5+SUM($D$6:D49)-SUM($E$6:E49)))","v":" "},null,null,null,6,"Ausblenden"]
[null,null,null,null,null,null,45,{"$f":"IF(D50+E50=0,\" \",SUM($H$5+SUM($D$6:D50)-SUM($E$6:E50)))","v":" "},null,null,null,6,"Ausblenden"]
[null,null,null,null,null,null,46,{"$f":"IF(D51+E51=0,\" \",SUM($H$5+SUM($D$6:D51)-SUM($E$6:E51)))","v":" "},null,null,null,6,"Ausblenden"]
[null,null,null,null,null,null,47,{"$f":"IF(D52+E52=0,\" \",SUM($H$5+SUM($D$6:D52)-SUM($E$6:E52)))","v":" "},null,null,null,6,"Ausblenden"]
[null,{"$f":"IF(SUM(D59:E105)<>0,\"Uebertrag\",\"Total\")","v":"Total"},null,{"$f":"SUM(D5:D52)","v":0},{"$f":"SUM(E5:E52)","v":0},null,null,{"$f":"H5+D53-E53","v":0},null,null,null,null,"Einblenden"]
[{"$f":"A1","v":"2023-03-04"},null,null,null,null,null,null,"Seite 2",null,null,null,null,{"$f":"IF(SUM($L$59:$L$105)<282,\"Einblenden\",\"Ausblenden\")","v":"Ausblenden"}]
[null,null,null,null,null,null,null,null,null,null,null,null,{"$f":"IF(SUM($L$59:$L$105)<282,\"Einblenden\",\"Ausblenden\")","v":"Ausblenden"}]
["Datum:","Text","FIBU","Einnahmen","Ausgaben",{"$f":"F3","v":"?"},null,"Saldo",null,null,null,null,{"$f":"IF(SUM($L$59:$L$105)<282,\"Einblenden\",\"Ausblenden\")","v":"Ausblenden"}]
[null,null,null,null,null,null,null,null,null,null,null,null,{"$f":"IF(SUM($L$59:$L$105)<282,\"Einblenden\",\"Ausblenden\")","v":"Ausblenden"}]
[null,"Uebertrag",null,{"$f":"D53","v":0},{"$f":"E53","v":0},null,null,{"$f":"H53","v":0},null,null,null,null,{"$f":"IF(SUM($L$59:$L$105)<282,\"Einblenden\",\"Ausblenden\")","v":"Ausblenden"}]
[null,null,null,null,null,null,48,{"$f":"IF(D59+E59=0,\" \",SUM($H$5+SUM($D$6:$D$52,$D$59:D59)-SUM($E$6:$E$52,$E$59:E59)))","v":" "},null,null,null,{"$f":"COUNTIF(A59:F59,\"\")","v":6},{"$f":"IF(L59<6,\"Einblenden\",\"Ausblenden\")","v":"Ausblenden"}]
[null,null,null,null,null,null,49,{"$f":"IF(D60+E60=0,\" \",SUM($H$5+SUM($D$6:$D$52,$D$59:D60)-SUM($E$6:$E$52,$E$59:E60)))","v":" "},null,null,null,{"$f":"COUNTIF(A60:F60,\"\")","v":6},{"$f":"IF(L60<6,\"Einblenden\",\"Ausblenden\")","v":"Ausblenden"}]
[null,null,null,null,null,null,50,{"$f":"IF(D61+E61=0,\" \",SUM($H$5+SUM($D$6:$D$52,$D$59:D61)-SUM($E$6:$E$52,$E$59:E61)))","v":" "},null,null,null,6,"Ausblenden"]
[null,null,null,null,null,null,51,{"$f":"IF(D62+E62=0,\" \",SUM($H$5+SUM($D$6:$D$52,$D$59:D62)-SUM($E$6:$E$52,$E$59:E62)))","v":" "},null,null,null,6,"Ausblenden"]
[null,null,null,null,null,null,52,{"$f":"IF(D63+E63=0,\" \",SUM($H$5+SUM($D$6:$D$52,$D$59:D63)-SUM($E$6:$E$52,$E$59:E63)))","v":" "},null,null,null,6,"Ausblenden"]
[null,null,null,null,null,null,53,{"$f":"IF(D64+E64=0,\" \",SUM($H$5+SUM($D$6:$D$52,$D$59:D64)-SUM($E$6:$E$52,$E$59:E64)))","v":" "},null,null,null,6,"Ausblenden"]
[null,null,null,null,null,null,54,{"$f":"IF(D65+E65=0,\" \",SUM($H$5+SUM($D$6:$D$52,$D$59:D65)-SUM($E$6:$E$52,$E$59:E65)))","v":" "},null,null,null,6,"Ausblenden"]
[null,null,null,null,null,null,55,{"$f":"IF(D66+E66=0,\" \",SUM($H$5+SUM($D$6:$D$52,$D$59:D66)-SUM($E$6:$E$52,$E$59:E66)))","v":" "},null,null,null,6,"Ausblenden"]
[null,null,null,null,null,null,56,{"$f":"IF(D67+E67=0,\" \",SUM($H$5+SUM($D$6:$D$52,$D$59:D67)-SUM($E$6:$E$52,$E$59:E67)))","v":" "},null,null,null,6,"Ausblenden"]
[null,null,null,null,null,null,57,{"$f":"IF(D68+E68=0,\" \",SUM($H$5+SUM($D$6:$D$52,$D$59:D68)-SUM($E$6:$E$52,$E$59:E68)))","v":" "},null,null,null,6,"Ausblenden"]
[null,null,null,null,null,null,58,{"$f":"IF(D69+E69=0,\" \",SUM($H$5+SUM($D$6:$D$52,$D$59:D69)-SUM($E$6:$E$52,$E$59:E69)))","v":" "},null,null,null,6,"Ausblenden"]
[null,null,null,null,null,null,59,{"$f":"IF(D70+E70=0,\" \",SUM($H$5+SUM($D$6:$D$52,$D$59:D70)-SUM($E$6:$E$52,$E$59:E70)))","v":" "},null,null,null,6,"Ausblenden"]
[null,null,null,null,null,null,60,{"$f":"IF(D71+E71=0,\" \",SUM($H$5+SUM($D$6:$D$52,$D$59:D71)-SUM($E$6:$E$52,$E$59:E71)))","v":" "},null,null,null,6,"Ausblenden"]
[null,null,null,null,null,null,61,{"$f":"IF(D72+E72=0,\" \",SUM($H$5+SUM($D$6:$D$52,$D$59:D72)-SUM($E$6:$E$52,$E$59:E72)))","v":" "},null,null,null,6,"Ausblenden"]
[null,null,null,null,null,null,62,{"$f":"IF(D73+E73=0,\" \",SUM($H$5+SUM($D$6:$D$52,$D$59:D73)-SUM($E$6:$E$52,$E$59:E73)))","v":" "},null,null,null,6,"Ausblenden"]
[null,null,null,null,null,null,63,{"$f":"IF(D74+E74=0,\" \",SUM($H$5+SUM($D$6:$D$52,$D$59:D74)-SUM($E$6:$E$52,$E$59:E74)))","v":" "},null,null,null,6,"Ausblenden"]
[null,null,null,null,null,null,64,{"$f":"IF(D75+E75=0,\" \",SUM($H$5+SUM($D$6:$D$52,$D$59:D75)-SUM($E$6:$E$52,$E$59:E75)))","v":" "},null,null,null,6,"Ausblenden"]
[null,null,null,null,null,null,65,{"$f":"IF(D76+E76=0,\" \",SUM($H$5+SUM($D$6:$D$52,$D$59:D76)-SUM($E$6:$E$52,$E$59:E76)))","v":" "},null,null,null,6,"Ausblenden"]
[null,null,null,null,null,null,66,{"$f":"IF(D77+E77=0,\" \",SUM($H$5+SUM($D$6:$D$52,$D$59:D77)-SUM($E$6:$E$52,$E$59:E77)))","v":" "},null,null,null,6,"Ausblenden"]
[null,null,null,null,null,null,67,{"$f":"IF(D78+E78=0,\" \",SUM($H$5+SUM($D$6:$D$52,$D$59:D78)-SUM($E$6:$E$52,$E$59:E78)))","v":" "},null,null,null,6,"Ausblenden"]
[null,null,null,null,null,null,68,{"$f":"IF(D79+E79=0,\" \",SUM($H$5+SUM($D$6:$D$52,$D$59:D79)-SUM($E$6:$E$52,$E$59:E79)))","v":" "},null,null,null,6,"Ausblenden"]
[null,null,null,null,null,null,69,{"$f":"IF(D80+E80=0,\" \",SUM($H$5+SUM($D$6:$D$52,$D$59:D80)-SUM($E$6:$E$52,$E$59:E80)))","v":" "},null,null,null,6,"Ausblenden"]
[null,null,null,null,null,null,70,{"$f":"IF(D81+E81=0,\" \",SUM($H$5+SUM($D$6:$D$52,$D$59:D81)-SUM($E$6:$E$52,$E$59:E81)))","v":" "},null,null,null,6,"Ausblenden"]
[null,null,null,null,null,null,71,{"$f":"IF(D82+E82=0,\" \",SUM($H$5+SUM($D$6:$D$52,$D$59:D82)-SUM($E$6:$E$52,$E$59:E82)))","v":" "},null,null,null,6,"Ausblenden"]
[null,null,null,null,null,null,72,{"$f":"IF(D83+E83=0,\" \",SUM($H$5+SUM($D$6:$D$52,$D$59:D83)-SUM($E$6:$E$52,$E$59:E83)))","v":" "},null,null,null,6,"Ausblenden"]
[null,null,null,null,null,null,73,{"$f":"IF(D84+E84=0,\" \",SUM($H$5+SUM($D$6:$D$52,$D$59:D84)-SUM($E$6:$E$52,$E$59:E84)))","v":" "},null,null,null,6,"Ausblenden"]
[null,null,null,null,null,null,74,{"$f":"IF(D85+E85=0,\" \",SUM($H$5+SUM($D$6:$D$52,$D$59:D85)-SUM($E$6:$E$52,$E$59:E85)))","v":" "},null,null,null,6,"Ausblenden"]
[null,null,null,null,null,null,75,{"$f":"IF(D86+E86=0,\" \",SUM($H$5+SUM($D$6:$D$52,$D$59:D86)-SUM($E$6:$E$52,$E$59:E86)))","v":" "},null,null,null,6,"Ausblenden"]
[null,null,null,null,null,null,76,{"$f":"IF(D87+E87=0,\" \",SUM($H$5+SUM($D$6:$D$52,$D$59:D87)-SUM($E$6:$E$52,$E$59:E87)))","v":" "},null,null,null,6,"Ausblenden"]
[null,null,null,null,null,null,77,{"$f":"IF(D88+E88=0,\" \",SUM($H$5+SUM($D$6:$D$52,$D$59:D88)-SUM($E$6:$E$52,$E$59:E88)))","v":" "},null,null,null,6,"Ausblenden"]
[null,null,null,null,null,null,78,{"$f":"IF(D89+E89=0,\" \",SUM($H$5+SUM($D$6:$D$52,$D$59:D89)-SUM($E$6:$E$52,$E$59:E89)))","v":" "},null,null,null,6,"Ausblenden"]
[null,null,null,null,null,null,79,{"$f":"IF(D90+E90=0,\" \",SUM($H$5+SUM($D$6:$D$52,$D$59:D90)-SUM($E$6:$E$52,$E$59:E90)))","v":" "},null,null,null,6,"Ausblenden"]
[null,null,null,null,null,null,80,{"$f":"IF(D91+E91=0,\" \",SUM($H$5+SUM($D$6:$D$52,$D$59:D91)-SUM($E$6:$E$52,$E$59:E91)))","v":" "},null,null,null,6,"Ausblenden"]
[null,null,null,null,null,null,81,{"$f":"IF(D92+E92=0,\" \",SUM($H$5+SUM($D$6:$D$52,$D$59:D92)-SUM($E$6:$E$52,$E$59:E92)))","v":" "},null,null,null,6,"Ausblenden"]
[null,null,null,null,null,null,82,{"$f":"IF(D93+E93=0,\" \",SUM($H$5+SUM($D$6:$D$52,$D$59:D93)-SUM($E$6:$E$52,$E$59:E93)))","v":" "},null,null,null,6,"Ausblenden"]
[null,null,null,null,null,null,83,{"$f":"IF(D94+E94=0,\" \",SUM($H$5+SUM($D$6:$D$52,$D$59:D94)-SUM($E$6:$E$52,$E$59:E94)))","v":" "},null,null,null,6,"Ausblenden"]
[null,null,null,null,null,null,84,{"$f":"IF(D95+E95=0,\" \",SUM($H$5+SUM($D$6:$D$52,$D$59:D95)-SUM($E$6:$E$52,$E$59:E95)))","v":" "},null,null,null,6,"Ausblenden"]
[null,null,null,null,null,null,85,{"$f":"IF(D96+E96=0,\" \",SUM($H$5+SUM($D$6:$D$52,$D$59:D96)-SUM($E$6:$E$52,$E$59:E96)))","v":" "},null,null,null,6,"Ausblenden"]
[null,null,null,null,null,null,86,{"$f":"IF(D97+E97=0,\" \",SUM($H$5+SUM($D$6:$D$52,$D$59:D97)-SUM($E$6:$E$52,$E$59:E97)))","v":" "},null,null,null,6,"Ausblenden"]
[null,null,null,null,null,null,87,{"$f":"IF(D98+E98=0,\" \",SUM($H$5+SUM($D$6:$D$52,$D$59:D98)-SUM($E$6:$E$52,$E$59:E98)))","v":" "},null,null,null,6,"Ausblenden"]
[null,null,null,null,null,null,88,{"$f":"IF(D99+E99=0,\" \",SUM($H$5+SUM($D$6:$D$52,$D$59:D99)-SUM($E$6:$E$52,$E$59:E99)))","v":" "},null,null,null,6,"Ausblenden"]
[null,null,null,null,null,null,89,{"$f":"IF(D100+E100=0,\" \",SUM($H$5+SUM($D$6:$D$52,$D$59:D100)-SUM($E$6:$E$52,$E$59:E100)))","v":" "},null,null,null,6,"Ausblenden"]
[null,null,null,null,null,null,90,{"$f":"IF(D101+E101=0,\" \",SUM($H$5+SUM($D$6:$D$52,$D$59:D101)-SUM($E$6:$E$52,$E$59:E101)))","v":" "},null,null,null,6,"Ausblenden"]
[null,null,null,null,null,null,91,{"$f":"IF(D102+E102=0,\" \",SUM($H$5+SUM($D$6:$D$52,$D$59:D102)-SUM($E$6:$E$52,$E$59:E102)))","v":" "},null,null,null,6,"Ausblenden"]
[null,null,null,null,null,null,92,{"$f":"IF(D103+E103=0,\" \",SUM($H$5+SUM($D$6:$D$52,$D$59:D103)-SUM($E$6:$E$52,$E$59:E103)))","v":" "},null,null,null,6,"Ausblenden"]
[null,null,null,null,null,null,93,{"$f":"IF(D104+E104=0,\" \",SUM($H$5+SUM($D$6:$D$52,$D$59:D104)-SUM($E$6:$E$52,$E$59:E104)))","v":" "},null,null,null,6,"Ausblenden"]
[null,null,null,null,null,null,94,{"$f":"IF(D105+E105=0,\" \",SUM($H$5+SUM($D$6:$D$52,$D$59:D105)-SUM($E$6:$E$52,$E$59:E105)))","v":" "},null,null,null,{"$f":"COUNTIF(A105:F105,\"\")","v":6},"Ausblenden"]
[null,{"$f":"IF(SUM(D112:E158)<>0,\"Uebertrag\",\"Total\")","v":"Total"},null,{"$f":"SUM(D58:D105)","v":0},{"$f":"SUM(E58:E105)","v":0},null,null,{"$f":"$H$5+D106-E106","v":0},null,null,null,null,{"$f":"IF(SUM($L$59:$L$105)<282,\"Einblenden\",\"Ausblenden\")","v":"Ausblenden"}]
[{"$f":"A1","v":"2023-03-04"},null,null,null,null,null,null,"Seite 3",null,null,null,null,{"$f":"IF(SUM($L$112:$L$158)<282,\"Einblenden\",\"Ausblenden\")","v":"Ausblenden"}]
[null,null,null,null,null,null,null,null,null,null,null,null,{"$f":"IF(SUM($L$112:$L$158)<282,\"Einblenden\",\"Ausblenden\")","v":"Ausblenden"}]
["Datum:","Text","FIBU","Einnahmen","Ausgaben",{"$f":"F3","v":"?"},null,"Saldo",null,null,null,null,{"$f":"IF(SUM($L$112:$L$158)<282,\"Einblenden\",\"Ausblenden\")","v":"Ausblenden"}]
[null,null,null,null,null,null,null,null,null,null,null,null,{"$f":"IF(SUM($L$112:$L$158)<282,\"Einblenden\",\"Ausblenden\")","v":"Ausblenden"}]
[null,"Uebertrag",null,{"$f":"D106","v":0},{"$f":"E106","v":0},null,null,{"$f":"H106","v":0},null,null,null,null,{"$f":"IF(SUM($L$112:$L$158)<282,\"Einblenden\",\"Ausblenden\")","v":"Ausblenden"}]
[null,null,null,null,null,null,95,{"$f":"IF(D112+E112=0,\" \",SUM($H$5+SUM($D$6:$D$52,$D$59:$D$105,$D$112:D112)-SUM($E$6:$E$52,$E$59:$E$105,$E$112:E112)))","v":" "},null,null,null,{"$f":"COUNTIF(A112:F112,\"\")","v":6},{"$f":"IF(L112<6,\"Einblenden\",\"Ausblenden\")","v":"Ausblenden"}]
[null,null,null,null,null,null,96,{"$f":"IF(D113+E113=0,\" \",SUM($H$5+SUM($D$6:$D$52,$D$59:$D$105,$D$112:D113)-SUM($E$6:$E$52,$E$59:$E$105,$E$112:E113)))","v":" "},null,null,null,{"$f":"COUNTIF(A113:F113,\"\")","v":6},"Ausblenden"]
[null,null,null,null,null,null,97,{"$f":"IF(D114+E114=0,\" \",SUM($H$5+SUM($D$6:$D$52,$D$59:$D$105,$D$112:D114)-SUM($E$6:$E$52,$E$59:$E$105,$E$112:E114)))","v":" "},null,null,null,6,"Ausblenden"]
[null,null,null,null,null,null,98,{"$f":"IF(D115+E115=0,\" \",SUM($H$5+SUM($D$6:$D$52,$D$59:$D$105,$D$112:D115)-SUM($E$6:$E$52,$E$59:$E$105,$E$112:E115)))","v":" "},null,null,null,6,"Ausblenden"]
[null,null,null,null,null,null,99,{"$f":"IF(D116+E116=0,\" \",SUM($H$5+SUM($D$6:$D$52,$D$59:$D$105,$D$112:D116)-SUM($E$6:$E$52,$E$59:$E$105,$E$112:E116)))","v":" "},null,null,null,6,"Ausblenden"]
[null,null,null,null,null,null,100,{"$f":"IF(D117+E117=0,\" \",SUM($H$5+SUM($D$6:$D$52,$D$59:$D$105,$D$112:D117)-SUM($E$6:$E$52,$E$59:$E$105,$E$112:E117)))","v":" "},null,null,null,6,"Ausblenden"]
[null,null,null,null,null,null,101,{"$f":"IF(D118+E118=0,\" \",SUM($H$5+SUM($D$6:$D$52,$D$59:$D$105,$D$112:D118)-SUM($E$6:$E$52,$E$59:$E$105,$E$112:E118)))","v":" "},null,null,null,6,"Ausblenden"]
[null,null,null,null,null,null,102,{"$f":"IF(D119+E119=0,\" \",SUM($H$5+SUM($D$6:$D$52,$D$59:$D$105,$D$112:D119)-SUM($E$6:$E$52,$E$59:$E$105,$E$112:E119)))","v":" "},null,null,null,6,"Ausblenden"]
[null,null,null,null,null,null,103,{"$f":"IF(D120+E120=0,\" \",SUM($H$5+SUM($D$6:$D$52,$D$59:$D$105,$D$112:D120)-SUM($E$6:$E$52,$E$59:$E$105,$E$112:E120)))","v":" "},null,null,null,6,"Ausblenden"]
[null,null,null,null,null,null,104,{"$f":"IF(D121+E121=0,\" \",SUM($H$5+SUM($D$6:$D$52,$D$59:$D$105,$D$112:D121)-SUM($E$6:$E$52,$E$59:$E$105,$E$112:E121)))","v":" "},null,null,null,6,"Ausblenden"]
[null,null,null,null,null,null,105,{"$f":"IF(D122+E122=0,\" \",SUM($H$5+SUM($D$6:$D$52,$D$59:$D$105,$D$112:D122)-SUM($E$6:$E$52,$E$59:$E$105,$E$112:E122)))","v":" "},null,null,null,6,"Ausblenden"]
[null,null,null,null,null,null,106,{"$f":"IF(D123+E123=0,\" \",SUM($H$5+SUM($D$6:$D$52,$D$59:$D$105,$D$112:D123)-SUM($E$6:$E$52,$E$59:$E$105,$E$112:E123)))","v":" "},null,null,null,6,"Ausblenden"]
[null,null,null,null,null,null,107,{"$f":"IF(D124+E124=0,\" \",SUM($H$5+SUM($D$6:$D$52,$D$59:$D$105,$D$112:D124)-SUM($E$6:$E$52,$E$59:$E$105,$E$112:E124)))","v":" "},null,null,null,6,"Ausblenden"]
[null,null,null,null,null,null,108,{"$f":"IF(D125+E125=0,\" \",SUM($H$5+SUM($D$6:$D$52,$D$59:$D$105,$D$112:D125)-SUM($E$6:$E$52,$E$59:$E$105,$E$112:E125)))","v":" "},null,null,null,6,"Ausblenden"]
[null,null,null,null,null,null,109,{"$f":"IF(D126+E126=0,\" \",SUM($H$5+SUM($D$6:$D$52,$D$59:$D$105,$D$112:D126)-SUM($E$6:$E$52,$E$59:$E$105,$E$112:E126)))","v":" "},null,null,null,6,"Ausblenden"]
[null,null,null,null,null,null,110,{"$f":"IF(D127+E127=0,\" \",SUM($H$5+SUM($D$6:$D$52,$D$59:$D$105,$D$112:D127)-SUM($E$6:$E$52,$E$59:$E$105,$E$112:E127)))","v":" "},null,null,null,6,"Ausblenden"]
[null,null,null,null,null,null,111,{"$f":"IF(D128+E128=0,\" \",SUM($H$5+SUM($D$6:$D$52,$D$59:$D$105,$D$112:D128)-SUM($E$6:$E$52,$E$59:$E$105,$E$112:E128)))","v":" "},null,null,null,6,"Ausblenden"]
[null,null,null,null,null,null,112,{"$f":"IF(D129+E129=0,\" \",SUM($H$5+SUM($D$6:$D$52,$D$59:$D$105,$D$112:D129)-SUM($E$6:$E$52,$E$59:$E$105,$E$112:E129)))","v":" "},null,null,null,6,"Ausblenden"]
[null,null,null,null,null,null,113,{"$f":"IF(D130+E130=0,\" \",SUM($H$5+SUM($D$6:$D$52,$D$59:$D$105,$D$112:D130)-SUM($E$6:$E$52,$E$59:$E$105,$E$112:E130)))","v":" "},null,null,null,6,"Ausblenden"]
[null,null,null,null,null,null,114,{"$f":"IF(D131+E131=0,\" \",SUM($H$5+SUM($D$6:$D$52,$D$59:$D$105,$D$112:D131)-SUM($E$6:$E$52,$E$59:$E$105,$E$112:E131)))","v":" "},null,null,null,6,"Ausblenden"]
[null,null,null,null,null,null,115,{"$f":"IF(D132+E132=0,\" \",SUM($H$5+SUM($D$6:$D$52,$D$59:$D$105,$D$112:D132)-SUM($E$6:$E$52,$E$59:$E$105,$E$112:E132)))","v":" "},null,null,null,6,"Ausblenden"]
[null,null,null,null,null,null,116,{"$f":"IF(D133+E133=0,\" \",SUM($H$5+SUM($D$6:$D$52,$D$59:$D$105,$D$112:D133)-SUM($E$6:$E$52,$E$59:$E$105,$E$112:E133)))","v":" "},null,null,null,6,"Ausblenden"]
[null,null,null,null,null,null,117,{"$f":"IF(D134+E134=0,\" \",SUM($H$5+SUM($D$6:$D$52,$D$59:$D$105,$D$112:D134)-SUM($E$6:$E$52,$E$59:$E$105,$E$112:E134)))","v":" "},null,null,null,6,"Ausblenden"]
[null,null,null,null,null,null,118,{"$f":"IF(D135+E135=0,\" \",SUM($H$5+SUM($D$6:$D$52,$D$59:$D$105,$D$112:D135)-SUM($E$6:$E$52,$E$59:$E$105,$E$112:E135)))","v":" "},null,null,null,6,"Ausblenden"]
[null,null,null,null,null,null,119,{"$f":"IF(D136+E136=0,\" \",SUM($H$5+SUM($D$6:$D$52,$D$59:$D$105,$D$112:D136)-SUM($E$6:$E$52,$E$59:$E$105,$E$112:E136)))","v":" "},null,null,null,6,"Ausblenden"]
[null,null,null,null,null,null,120,{"$f":"IF(D137+E137=0,\" \",SUM($H$5+SUM($D$6:$D$52,$D$59:$D$105,$D$112:D137)-SUM($E$6:$E$52,$E$59:$E$105,$E$112:E137)))","v":" "},null,null,null,6,"Ausblenden"]
[null,null,null,null,null,null,121,{"$f":"IF(D138+E138=0,\" \",SUM($H$5+SUM($D$6:$D$52,$D$59:$D$105,$D$112:D138)-SUM($E$6:$E$52,$E$59:$E$105,$E$112:E138)))","v":" "},null,null,null,6,"Ausblenden"]
[null,null,null,null,null,null,122,{"$f":"IF(D139+E139=0,\" \",SUM($H$5+SUM($D$6:$D$52,$D$59:$D$105,$D$112:D139)-SUM($E$6:$E$52,$E$59:$E$105,$E$112:E139)))","v":" "},null,null,null,6,"Ausblenden"]
[null,null,null,null,null,null,123,{"$f":"IF(D140+E140=0,\" \",SUM($H$5+SUM($D$6:$D$52,$D$59:$D$105,$D$112:D140)-SUM($E$6:$E$52,$E$59:$E$105,$E$112:E140)))","v":" "},null,null,null,6,"Ausblenden"]
[null,null,null,null,null,null,124,{"$f":"IF(D141+E141=0,\" \",SUM($H$5+SUM($D$6:$D$52,$D$59:$D$105,$D$112:D141)-SUM($E$6:$E$52,$E$59:$E$105,$E$112:E141)))","v":" "},null,null,null,6,"Ausblenden"]
[null,null,null,null,null,null,125,{"$f":"IF(D142+E142=0,\" \",SUM($H$5+SUM($D$6:$D$52,$D$59:$D$105,$D$112:D142)-SUM($E$6:$E$52,$E$59:$E$105,$E$112:E142)))","v":" "},null,null,null,6,"Ausblenden"]
[null,null,null,null,null,null,126,{"$f":"IF(D143+E143=0,\" \",SUM($H$5+SUM($D$6:$D$52,$D$59:$D$105,$D$112:D143)-SUM($E$6:$E$52,$E$59:$E$105,$E$112:E143)))","v":" "},null,null,null,6,"Ausblenden"]
[null,null,null,null,null,null,127,{"$f":"IF(D144+E144=0,\" \",SUM($H$5+SUM($D$6:$D$52,$D$59:$D$105,$D$112:D144)-SUM($E$6:$E$52,$E$59:$E$105,$E$112:E144)))","v":" "},null,null,null,6,"Ausblenden"]
[null,null,null,null,null,null,128,{"$f":"IF(D145+E145=0,\" \",SUM($H$5+SUM($D$6:$D$52,$D$59:$D$105,$D$112:D145)-SUM($E$6:$E$52,$E$59:$E$105,$E$112:E145)))","v":" "},null,null,null,6,"Ausblenden"]
[null,null,null,null,null,null,129,{"$f":"IF(D146+E146=0,\" \",SUM($H$5+SUM($D$6:$D$52,$D$59:$D$105,$D$112:D146)-SUM($E$6:$E$52,$E$59:$E$105,$E$112:E146)))","v":" "},null,null,null,6,"Ausblenden"]
[null,null,null,null,null,null,130,{"$f":"IF(D147+E147=0,\" \",SUM($H$5+SUM($D$6:$D$52,$D$59:$D$105,$D$112:D147)-SUM($E$6:$E$52,$E$59:$E$105,$E$112:E147)))","v":" "},null,null,null,6,"Ausblenden"]
[null,null,null,null,null,null,131,{"$f":"IF(D148+E148=0,\" \",SUM($H$5+SUM($D$6:$D$52,$D$59:$D$105,$D$112:D148)-SUM($E$6:$E$52,$E$59:$E$105,$E$112:E148)))","v":" "},null,null,null,6,"Ausblenden"]
[null,null,null,null,null,null,132,{"$f":"IF(D149+E149=0,\" \",SUM($H$5+SUM($D$6:$D$52,$D$59:$D$105,$D$112:D149)-SUM($E$6:$E$52,$E$59:$E$105,$E$112:E149)))","v":" "},null,null,null,6,"Ausblenden"]
[null,null,null,null,null,null,133,{"$f":"IF(D150+E150=0,\" \",SUM($H$5+SUM($D$6:$D$52,$D$59:$D$105,$D$112:D150)-SUM($E$6:$E$52,$E$59:$E$105,$E$112:E150)))","v":" "},null,null,null,6,"Ausblenden"]
[null,null,null,null,null,null,134,{"$f":"IF(D151+E151=0,\" \",SUM($H$5+SUM($D$6:$D$52,$D$59:$D$105,$D$112:D151)-SUM($E$6:$E$52,$E$59:$E$105,$E$112:E151)))","v":" "},null,null,null,6,"Ausblenden"]
[null,null,null,null,null,null,135,{"$f":"IF(D152+E152=0,\" \",SUM($H$5+SUM($D$6:$D$52,$D$59:$D$105,$D$112:D152)-SUM($E$6:$E$52,$E$59:$E$105,$E$112:E152)))","v":" "},null,null,null,6,"Ausblenden"]
[null,null,null,null,null,null,136,{"$f":"IF(D153+E153=0,\" \",SUM($H$5+SUM($D$6:$D$52,$D$59:$D$105,$D$112:D153)-SUM($E$6:$E$52,$E$59:$E$105,$E$112:E153)))","v":" "},null,null,null,6,"Ausblenden"]
[null,null,null,null,null,null,137,{"$f":"IF(D154+E154=0,\" \",SUM($H$5+SUM($D$6:$D$52,$D$59:$D$105,$D$112:D154)-SUM($E$6:$E$52,$E$59:$E$105,$E$112:E154)))","v":" "},null,null,null,6,"Ausblenden"]
[null,null,null,null,null,null,138,{"$f":"IF(D155+E155=0,\" \",SUM($H$5+SUM($D$6:$D$52,$D$59:$D$105,$D$112:D155)-SUM($E$6:$E$52,$E$59:$E$105,$E$112:E155)))","v":" "},null,null,null,6,"Ausblenden"]
[null,null,null,null,null,null,139,{"$f":"IF(D156+E156=0,\" \",SUM($H$5+SUM($D$6:$D$52,$D$59:$D$105,$D$112:D156)-SUM($E$6:$E$52,$E$59:$E$105,$E$112:E156)))","v":" "},null,null,null,6,"Ausblenden"]
[null,null,null,null,null,null,140,{"$f":"IF(D157+E157=0,\" \",SUM($H$5+SUM($D$6:$D$52,$D$59:$D$105,$D$112:D157)-SUM($E$6:$E$52,$E$59:$E$105,$E$112:E157)))","v":" "},null,null,null,6,"Ausblenden"]
[null,null,null,null,null,null,141,{"$f":"IF(D158+E158=0,\" \",SUM($H$5+SUM($D$6:$D$52,$D$59:$D$105,$D$112:D158)-SUM($E$6:$E$52,$E$59:$E$105,$E$112:E158)))","v":" "},null,null,null,6,"Ausblenden"]
[null,"Total",null,{"$f":"SUM(D111:D158)","v":0},{"$f":"SUM(E111:E158)","v":0},null,null,{"$f":"$H$5+D159-E159","v":0},null,null,null,null,{"$f":"IF(SUM($L$112:$L$158)<282,\"Einblenden\",\"Ausblenden\")","v":"Ausblenden"}]

{"sheet":"April","index":4,"n_rows":159,"n_cols":13,"rows_kept":159,"cut":false,"hidden":false,"merged":[]}
[{"$f":"März!A1+31","v":"2023-04-04"}]
[]
["Datum:","Text","FIBU","Einnahmen","Ausgaben",{"$f":"Januar!F3","v":"?"},null,"Saldo"]
[]
[1,"Saldovortrag",null,null,null,null,null,{"$f":"SUM(März!H159)","v":0}]
[null,null,null,null,null,null,1,{"$f":"IF(D6+E6=0,\" \",SUM($H$5+SUM($D$6:D6)-SUM($E$6:E6)))","v":" "},null,null,null,null,"Einblenden"]
[null,null,null,null,null,null,2,{"$f":"IF(D7+E7=0,\" \",SUM($H$5+SUM($D$6:D7)-SUM($E$6:E7)))","v":" "},null,null,null,{"$f":"COUNTIF(A7:F7,\"\")","v":6},{"$f":"IF(L7<6,\"Einblenden\",\"Ausblenden\")","v":"Ausblenden"}]
[null,null,null,null,null,null,3,{"$f":"IF(D8+E8=0,\" \",SUM($H$5+SUM($D$6:D8)-SUM($E$6:E8)))","v":" "},null,null,null,{"$f":"COUNTIF(A8:F8,\"\")","v":6},{"$f":"IF(L8<6,\"Einblenden\",\"Ausblenden\")","v":"Ausblenden"}]
[null,null,null,null,null,null,4,{"$f":"IF(D9+E9=0,\" \",SUM($H$5+SUM($D$6:D9)-SUM($E$6:E9)))","v":" "},null,null,null,6,"Ausblenden"]
[null,null,null,null,null,null,5,{"$f":"IF(D10+E10=0,\" \",SUM($H$5+SUM($D$6:D10)-SUM($E$6:E10)))","v":" "},null,null,null,6,"Ausblenden"]
[null,null,null,null,null,null,6,{"$f":"IF(D11+E11=0,\" \",SUM($H$5+SUM($D$6:D11)-SUM($E$6:E11)))","v":" "},null,null,null,6,"Ausblenden"]
[null,null,null,null,null,null,7,{"$f":"IF(D12+E12=0,\" \",SUM($H$5+SUM($D$6:D12)-SUM($E$6:E12)))","v":" "},null,null,null,6,"Ausblenden"]
[null,null,null,null,null,null,8,{"$f":"IF(D13+E13=0,\" \",SUM($H$5+SUM($D$6:D13)-SUM($E$6:E13)))","v":" "},null,null,null,6,"Ausblenden"]
[null,null,null,null,null,null,9,{"$f":"IF(D14+E14=0,\" \",SUM($H$5+SUM($D$6:D14)-SUM($E$6:E14)))","v":" "},null,null,null,6,"Ausblenden"]
[null,null,null,null,null,null,10,{"$f":"IF(D15+E15=0,\" \",SUM($H$5+SUM($D$6:D15)-SUM($E$6:E15)))","v":" "},null,null,null,6,"Ausblenden"]
[null,null,null,null,null,null,11,{"$f":"IF(D16+E16=0,\" \",SUM($H$5+SUM($D$6:D16)-SUM($E$6:E16)))","v":" "},null,null,null,6,"Ausblenden"]
[null,null,null,null,null,null,12,{"$f":"IF(D17+E17=0,\" \",SUM($H$5+SUM($D$6:D17)-SUM($E$6:E17)))","v":" "},null,null,null,6,"Ausblenden"]
[null,null,null,null,null,null,13,{"$f":"IF(D18+E18=0,\" \",SUM($H$5+SUM($D$6:D18)-SUM($E$6:E18)))","v":" "},null,null,null,6,"Ausblenden"]
[null,null,null,null,null,null,14,{"$f":"IF(D19+E19=0,\" \",SUM($H$5+SUM($D$6:D19)-SUM($E$6:E19)))","v":" "},null,null,null,6,"Ausblenden"]
[null,null,null,null,null,null,15,{"$f":"IF(D20+E20=0,\" \",SUM($H$5+SUM($D$6:D20)-SUM($E$6:E20)))","v":" "},null,null,null,6,"Ausblenden"]
[null,null,null,null,null,null,16,{"$f":"IF(D21+E21=0,\" \",SUM($H$5+SUM($D$6:D21)-SUM($E$6:E21)))","v":" "},null,null,null,6,"Ausblenden"]
[null,null,null,null,null,null,17,{"$f":"IF(D22+E22=0,\" \",SUM($H$5+SUM($D$6:D22)-SUM($E$6:E22)))","v":" "},null,null,null,6,"Ausblenden"]
[null,null,null,null,null,null,18,{"$f":"IF(D23+E23=0,\" \",SUM($H$5+SUM($D$6:D23)-SUM($E$6:E23)))","v":" "},null,null,null,6,"Ausblenden"]
[null,null,null,null,null,null,19,{"$f":"IF(D24+E24=0,\" \",SUM($H$5+SUM($D$6:D24)-SUM($E$6:E24)))","v":" "},null,null,null,6,"Ausblenden"]
[null,null,null,null,null,null,20,{"$f":"IF(D25+E25=0,\" \",SUM($H$5+SUM($D$6:D25)-SUM($E$6:E25)))","v":" "},null,null,null,6,"Ausblenden"]
[null,null,null,null,null,null,21,{"$f":"IF(D26+E26=0,\" \",SUM($H$5+SUM($D$6:D26)-SUM($E$6:E26)))","v":" "},null,null,null,6,"Ausblenden"]
[null,null,null,null,null,null,22,{"$f":"IF(D27+E27=0,\" \",SUM($H$5+SUM($D$6:D27)-SUM($E$6:E27)))","v":" "},null,null,null,6,"Ausblenden"]
[null,null,null,null,null,null,23,{"$f":"IF(D28+E28=0,\" \",SUM($H$5+SUM($D$6:D28)-SUM($E$6:E28)))","v":" "},null,null,null,6,"Ausblenden"]
[null,null,null,null,null,null,24,{"$f":"IF(D29+E29=0,\" \",SUM($H$5+SUM($D$6:D29)-SUM($E$6:E29)))","v":" "},null,null,null,6,"Ausblenden"]
[null,null,null,null,null,null,25,{"$f":"IF(D30+E30=0,\" \",SUM($H$5+SUM($D$6:D30)-SUM($E$6:E30)))","v":" "},null,null,null,6,"Ausblenden"]
[null,null,null,null,null,null,26,{"$f":"IF(D31+E31=0,\" \",SUM($H$5+SUM($D$6:D31)-SUM($E$6:E31)))","v":" "},null,null,null,6,"Ausblenden"]
[null,null,null,null,null,null,27,{"$f":"IF(D32+E32=0,\" \",SUM($H$5+SUM($D$6:D32)-SUM($E$6:E32)))","v":" "},null,null,null,6,"Ausblenden"]
[null,null,null,null,null,null,28,{"$f":"IF(D33+E33=0,\" \",SUM($H$5+SUM($D$6:D33)-SUM($E$6:E33)))","v":" "},null,null,null,6,"Ausblenden"]
[null,null,null,null,null,null,29,{"$f":"IF(D34+E34=0,\" \",SUM($H$5+SUM($D$6:D34)-SUM($E$6:E34)))","v":" "},null,null,null,6,"Ausblenden"]
[null,null,null,null,null,null,30,{"$f":"IF(D35+E35=0,\" \",SUM($H$5+SUM($D$6:D35)-SUM($E$6:E35)))","v":" "},null,null,null,6,"Ausblenden"]
[null,null,null,null,null,null,31,{"$f":"IF(D36+E36=0,\" \",SUM($H$5+SUM($D$6:D36)-SUM($E$6:E36)))","v":" "},null,null,null,6,"Ausblenden"]
[null,null,null,null,null,null,32,{"$f":"IF(D37+E37=0,\" \",SUM($H$5+SUM($D$6:D37)-SUM($E$6:E37)))","v":" "},null,null,null,6,"Ausblenden"]
[null,null,null,null,null,null,33,{"$f":"IF(D38+E38=0,\" \",SUM($H$5+SUM($D$6:D38)-SUM($E$6:E38)))","v":" "},null,null,null,6,"Ausblenden"]
[null,null,null,null,null,null,34,{"$f":"IF(D39+E39=0,\" \",SUM($H$5+SUM($D$6:D39)-SUM($E$6:E39)))","v":" "},null,null,null,6,"Ausblenden"]
[null,null,null,null,null,null,35,{"$f":"IF(D40+E40=0,\" \",SUM($H$5+SUM($D$6:D40)-SUM($E$6:E40)))","v":" "},null,null,null,6,"Ausblenden"]
[null,null,null,null,null,null,36,{"$f":"IF(D41+E41=0,\" \",SUM($H$5+SUM($D$6:D41)-SUM($E$6:E41)))","v":" "},null,null,null,6,"Ausblenden"]
[null,null,null,null,null,null,37,{"$f":"IF(D42+E42=0,\" \",SUM($H$5+SUM($D$6:D42)-SUM($E$6:E42)))","v":" "},null,null,null,6,"Ausblenden"]
[null,null,null,null,null,null,38,{"$f":"IF(D43+E43=0,\" \",SUM($H$5+SUM($D$6:D43)-SUM($E$6:E43)))","v":" "},null,null,null,6,"Ausblenden"]
[null,null,null,null,null,null,39,{"$f":"IF(D44+E44=0,\" \",SUM($H$5+SUM($D$6:D44)-SUM($E$6:E44)))","v":" "},null,null,null,6,"Ausblenden"]
[null,null,null,null,null,null,40,{"$f":"IF(D45+E45=0,\" \",SUM($H$5+SUM($D$6:D45)-SUM($E$6:E45)))","v":" "},null,null,null,6,"Ausblenden"]
[null,null,null,null,null,null,41,{"$f":"IF(D46+E46=0,\" \",SUM($H$5+SUM($D$6:D46)-SUM($E$6:E46)))","v":" "},null,null,null,6,"Ausblenden"]
[null,null,null,null,null,null,42,{"$f":"IF(D47+E47=0,\" \",SUM($H$5+SUM($D$6:D47)-SUM($E$6:E47)))","v":" "},null,null,null,6,"Ausblenden"]
[null,null,null,null,null,null,43,{"$f":"IF(D48+E48=0,\" \",SUM($H$5+SUM($D$6:D48)-SUM($E$6:E48)))","v":" "},null,null,null,6,"Ausblenden"]
[null,null,null,null,null,null,44,{"$f":"IF(D49+E49=0,\" \",SUM($H$5+SUM($D$6:D49)-SUM($E$6:E49)))","v":" "},null,null,null,6,"Ausblenden"]
[null,null,null,null,null,null,45,{"$f":"IF(D50+E50=0,\" \",SUM($H$5+SUM($D$6:D50)-SUM($E$6:E50)))","v":" "},null,null,null,6,"Ausblenden"]
[null,null,null,null,null,null,46,{"$f":"IF(D51+E51=0,\" \",SUM($H$5+SUM($D$6:D51)-SUM($E$6:E51)))","v":" "},null,null,null,6,"Ausblenden"]
[null,null,null,null,null,null,47,{"$f":"IF(D52+E52=0,\" \",SUM($H$5+SUM($D$6:D52)-SUM($E$6:E52)))","v":" "},null,null,null,6,"Ausblenden"]
[null,{"$f":"IF(SUM(D59:E105)<>0,\"Uebertrag\",\"Total\")","v":"Total"},null,{"$f":"SUM(D5:D52)","v":0},{"$f":"SUM(E5:E52)","v":0},null,null,{"$f":"H5+D53-E53","v":0},null,null,null,null,"Einblenden"]
[{"$f":"A1","v":"2023-04-04"},null,null,null,null,null,null,"Seite 2",null,null,null,null,{"$f":"IF(SUM($L$59:$L$105)<282,\"Einblenden\",\"Ausblenden\")","v":"Ausblenden"}]
[null,null,null,null,null,null,null,null,null,null,null,null,{"$f":"IF(SUM($L$59:$L$105)<282,\"Einblenden\",\"Ausblenden\")","v":"Ausblenden"}]
["Datum:","Text","FIBU","Einnahmen","Ausgaben",{"$f":"F3","v":"?"},null,"Saldo",null,null,null,null,{"$f":"IF(SUM($L$59:$L$105)<282,\"Einblenden\",\"Ausblenden\")","v":"Ausblenden"}]
[null,null,null,null,null,null,null,null,null,null,null,null,{"$f":"IF(SUM($L$59:$L$105)<282,\"Einblenden\",\"Ausblenden\")","v":"Ausblenden"}]
[null,"Uebertrag",null,{"$f":"D53","v":0},{"$f":"E53","v":0},null,null,{"$f":"H53","v":0},null,null,null,null,{"$f":"IF(SUM($L$59:$L$105)<282,\"Einblenden\",\"Ausblenden\")","v":"Ausblenden"}]
[null,null,null,null,null,null,48,{"$f":"IF(D59+E59=0,\" \",SUM($H$5+SUM($D$6:$D$52,$D$59:D59)-SUM($E$6:$E$52,$E$59:E59)))","v":" "},null,null,null,{"$f":"COUNTIF(A59:F59,\"\")","v":6},{"$f":"IF(L59<6,\"Einblenden\",\"Ausblenden\")","v":"Ausblenden"}]
[null,null,null,null,null,null,49,{"$f":"IF(D60+E60=0,\" \",SUM($H$5+SUM($D$6:$D$52,$D$59:D60)-SUM($E$6:$E$52,$E$59:E60)))","v":" "},null,null,null,{"$f":"COUNTIF(A60:F60,\"\")","v":6},{"$f":"IF(L60<6,\"Einblenden\",\"Ausblenden\")","v":"Ausblenden"}]
[null,null,null,null,null,null,50,{"$f":"IF(D61+E61=0,\" \",SUM($H$5+SUM($D$6:$D$52,$D$59:D61)-SUM($E$6:$E$52,$E$59:E61)))","v":" "},null,null,null,6,"Ausblenden"]
[null,null,null,null,null,null,51,{"$f":"IF(D62+E62=0,\" \",SUM($H$5+SUM($D$6:$D$52,$D$59:D62)-SUM($E$6:$E$52,$E$59:E62)))","v":" "},null,null,null,6,"Ausblenden"]
[null,null,null,null,null,null,52,{"$f":"IF(D63+E63=0,\" \",SUM($H$5+SUM($D$6:$D$52,$D$59:D63)-SUM($E$6:$E$52,$E$59:E63)))","v":" "},null,null,null,6,"Ausblenden"]
[null,null,null,null,null,null,53,{"$f":"IF(D64+E64=0,\" \",SUM($H$5+SUM($D$6:$D$52,$D$59:D64)-SUM($E$6:$E$52,$E$59:E64)))","v":" "},null,null,null,6,"Ausblenden"]
[null,null,null,null,null,null,54,{"$f":"IF(D65+E65=0,\" \",SUM($H$5+SUM($D$6:$D$52,$D$59:D65)-SUM($E$6:$E$52,$E$59:E65)))","v":" "},null,null,null,6,"Ausblenden"]
[null,null,null,null,null,null,55,{"$f":"IF(D66+E66=0,\" \",SUM($H$5+SUM($D$6:$D$52,$D$59:D66)-SUM($E$6:$E$52,$E$59:E66)))","v":" "},null,null,null,6,"Ausblenden"]
[null,null,null,null,null,null,56,{"$f":"IF(D67+E67=0,\" \",SUM($H$5+SUM($D$6:$D$52,$D$59:D67)-SUM($E$6:$E$52,$E$59:E67)))","v":" "},null,null,null,6,"Ausblenden"]
[null,null,null,null,null,null,57,{"$f":"IF(D68+E68=0,\" \",SUM($H$5+SUM($D$6:$D$52,$D$59:D68)-SUM($E$6:$E$52,$E$59:E68)))","v":" "},null,null,null,6,"Ausblenden"]
[null,null,null,null,null,null,58,{"$f":"IF(D69+E69=0,\" \",SUM($H$5+SUM($D$6:$D$52,$D$59:D69)-SUM($E$6:$E$52,$E$59:E69)))","v":" "},null,null,null,6,"Ausblenden"]
[null,null,null,null,null,null,59,{"$f":"IF(D70+E70=0,\" \",SUM($H$5+SUM($D$6:$D$52,$D$59:D70)-SUM($E$6:$E$52,$E$59:E70)))","v":" "},null,null,null,6,"Ausblenden"]
[null,null,null,null,null,null,60,{"$f":"IF(D71+E71=0,\" \",SUM($H$5+SUM($D$6:$D$52,$D$59:D71)-SUM($E$6:$E$52,$E$59:E71)))","v":" "},null,null,null,6,"Ausblenden"]
[null,null,null,null,null,null,61,{"$f":"IF(D72+E72=0,\" \",SUM($H$5+SUM($D$6:$D$52,$D$59:D72)-SUM($E$6:$E$52,$E$59:E72)))","v":" "},null,null,null,6,"Ausblenden"]
[null,null,null,null,null,null,62,{"$f":"IF(D73+E73=0,\" \",SUM($H$5+SUM($D$6:$D$52,$D$59:D73)-SUM($E$6:$E$52,$E$59:E73)))","v":" "},null,null,null,6,"Ausblenden"]
[null,null,null,null,null,null,63,{"$f":"IF(D74+E74=0,\" \",SUM($H$5+SUM($D$6:$D$52,$D$59:D74)-SUM($E$6:$E$52,$E$59:E74)))","v":" "},null,null,null,6,"Ausblenden"]
[null,null,null,null,null,null,64,{"$f":"IF(D75+E75=0,\" \",SUM($H$5+SUM($D$6:$D$52,$D$59:D75)-SUM($E$6:$E$52,$E$59:E75)))","v":" "},null,null,null,6,"Ausblenden"]
[null,null,null,null,null,null,65,{"$f":"IF(D76+E76=0,\" \",SUM($H$5+SUM($D$6:$D$52,$D$59:D76)-SUM($E$6:$E$52,$E$59:E76)))","v":" "},null,null,null,6,"Ausblenden"]
[null,null,null,null,null,null,66,{"$f":"IF(D77+E77=0,\" \",SUM($H$5+SUM($D$6:$D$52,$D$59:D77)-SUM($E$6:$E$52,$E$59:E77)))","v":" "},null,null,null,6,"Ausblenden"]
[null,null,null,null,null,null,67,{"$f":"IF(D78+E78=0,\" \",SUM($H$5+SUM($D$6:$D$52,$D$59:D78)-SUM($E$6:$E$52,$E$59:E78)))","v":" "},null,null,null,6,"Ausblenden"]
[null,null,null,null,null,null,68,{"$f":"IF(D79+E79=0,\" \",SUM($H$5+SUM($D$6:$D$52,$D$59:D79)-SUM($E$6:$E$52,$E$59:E79)))","v":" "},null,null,null,6,"Ausblenden"]
[null,null,null,null,null,null,69,{"$f":"IF(D80+E80=0,\" \",SUM($H$5+SUM($D$6:$D$52,$D$59:D80)-SUM($E$6:$E$52,$E$59:E80)))","v":" "},null,null,null,6,"Ausblenden"]
[null,null,null,null,null,null,70,{"$f":"IF(D81+E81=0,\" \",SUM($H$5+SUM($D$6:$D$52,$D$59:D81)-SUM($E$6:$E$52,$E$59:E81)))","v":" "},null,null,null,6,"Ausblenden"]
[null,null,null,null,null,null,71,{"$f":"IF(D82+E82=0,\" \",SUM($H$5+SUM($D$6:$D$52,$D$59:D82)-SUM($E$6:$E$52,$E$59:E82)))","v":" "},null,null,null,6,"Ausblenden"]
[null,null,null,null,null,null,72,{"$f":"IF(D83+E83=0,\" \",SUM($H$5+SUM($D$6:$D$52,$D$59:D83)-SUM($E$6:$E$52,$E$59:E83)))","v":" "},null,null,null,6,"Ausblenden"]
[null,null,null,null,null,null,73,{"$f":"IF(D84+E84=0,\" \",SUM($H$5+SUM($D$6:$D$52,$D$59:D84)-SUM($E$6:$E$52,$E$59:E84)))","v":" "},null,null,null,6,"Ausblenden"]
[null,null,null,null,null,null,74,{"$f":"IF(D85+E85=0,\" \",SUM($H$5+SUM($D$6:$D$52,$D$59:D85)-SUM($E$6:$E$52,$E$59:E85)))","v":" "},null,null,null,6,"Ausblenden"]
[null,null,null,null,null,null,75,{"$f":"IF(D86+E86=0,\" \",SUM($H$5+SUM($D$6:$D$52,$D$59:D86)-SUM($E$6:$E$52,$E$59:E86)))","v":" "},null,null,null,6,"Ausblenden"]
[null,null,null,null,null,null,76,{"$f":"IF(D87+E87=0,\" \",SUM($H$5+SUM($D$6:$D$52,$D$59:D87)-SUM($E$6:$E$52,$E$59:E87)))","v":" "},null,null,null,6,"Ausblenden"]
[null,null,null,null,null,null,77,{"$f":"IF(D88+E88=0,\" \",SUM($H$5+SUM($D$6:$D$52,$D$59:D88)-SUM($E$6:$E$52,$E$59:E88)))","v":" "},null,null,null,6,"Ausblenden"]
[null,null,null,null,null,null,78,{"$f":"IF(D89+E89=0,\" \",SUM($H$5+SUM($D$6:$D$52,$D$59:D89)-SUM($E$6:$E$52,$E$59:E89)))","v":" "},null,null,null,6,"Ausblenden"]
[null,null,null,null,null,null,79,{"$f":"IF(D90+E90=0,\" \",SUM($H$5+SUM($D$6:$D$52,$D$59:D90)-SUM($E$6:$E$52,$E$59:E90)))","v":" "},null,null,null,6,"Ausblenden"]
[null,null,null,null,null,null,80,{"$f":"IF(D91+E91=0,\" \",SUM($H$5+SUM($D$6:$D$52,$D$59:D91)-SUM($E$6:$E$52,$E$59:E91)))","v":" "},null,null,null,6,"Ausblenden"]
[null,null,null,null,null,null,81,{"$f":"IF(D92+E92=0,\" \",SUM($H$5+SUM($D$6:$D$52,$D$59:D92)-SUM($E$6:$E$52,$E$59:E92)))","v":" "},null,null,null,6,"Ausblenden"]
[null,null,null,null,null,null,82,{"$f":"IF(D93+E93=0,\" \",SUM($H$5+SUM($D$6:$D$52,$D$59:D93)-SUM($E$6:$E$52,$E$59:E93)))","v":" "},null,null,null,6,"Ausblenden"]
[null,null,null,null,null,null,83,{"$f":"IF(D94+E94=0,\" \",SUM($H$5+SUM($D$6:$D$52,$D$59:D94)-SUM($E$6:$E$52,$E$59:E94)))","v":" "},null,null,null,6,"Ausblenden"]
[null,null,null,null,null,null,84,{"$f":"IF(D95+E95=0,\" \",SUM($H$5+SUM($D$6:$D$52,$D$59:D95)-SUM($E$6:$E$52,$E$59:E95)))","v":" "},null,null,null,6,"Ausblenden"]
[null,null,null,null,null,null,85,{"$f":"IF(D96+E96=0,\" \",SUM($H$5+SUM($D$6:$D$52,$D$59:D96)-SUM($E$6:$E$52,$E$59:E96)))","v":" "},null,null,null,6,"Ausblenden"]
[null,null,null,null,null,null,86,{"$f":"IF(D97+E97=0,\" \",SUM($H$5+SUM($D$6:$D$52,$D$59:D97)-SUM($E$6:$E$52,$E$59:E97)))","v":" "},null,null,null,6,"Ausblenden"]
[null,null,null,null,null,null,87,{"$f":"IF(D98+E98=0,\" \",SUM($H$5+SUM($D$6:$D$52,$D$59:D98)-SUM($E$6:$E$52,$E$59:E98)))","v":" "},null,null,null,6,"Ausblenden"]
[null,null,null,null,null,null,88,{"$f":"IF(D99+E99=0,\" \",SUM($H$5+SUM($D$6:$D$52,$D$59:D99)-SUM($E$6:$E$52,$E$59:E99)))","v":" "},null,null,null,6,"Ausblenden"]
[null,null,null,null,null,null,89,{"$f":"IF(D100+E100=0,\" \",SUM($H$5+SUM($D$6:$D$52,$D$59:D100)-SUM($E$6:$E$52,$E$59:E100)))","v":" "},null,null,null,6,"Ausblenden"]
[null,null,null,null,null,null,90,{"$f":"IF(D101+E101=0,\" \",SUM($H$5+SUM($D$6:$D$52,$D$59:D101)-SUM($E$6:$E$52,$E$59:E101)))","v":" "},null,null,null,6,"Ausblenden"]
[null,null,null,null,null,null,91,{"$f":"IF(D102+E102=0,\" \",SUM($H$5+SUM($D$6:$D$52,$D$59:D102)-SUM($E$6:$E$52,$E$59:E102)))","v":" "},null,null,null,6,"Ausblenden"]
[null,null,null,null,null,null,92,{"$f":"IF(D103+E103=0,\" \",SUM($H$5+SUM($D$6:$D$52,$D$59:D103)-SUM($E$6:$E$52,$E$59:E103)))","v":" "},null,null,null,6,"Ausblenden"]
[null,null,null,null,null,null,93,{"$f":"IF(D104+E104=0,\" \",SUM($H$5+SUM($D$6:$D$52,$D$59:D104)-SUM($E$6:$E$52,$E$59:E104)))","v":" "},null,null,null,6,"Ausblenden"]
[null,null,null,null,null,null,94,{"$f":"IF(D105+E105=0,\" \",SUM($H$5+SUM($D$6:$D$52,$D$59:D105)-SUM($E$6:$E$52,$E$59:E105)))","v":" "},null,null,null,{"$f":"COUNTIF(A105:F105,\"\")","v":6},"Ausblenden"]
[null,{"$f":"IF(SUM(D112:E158)<>0,\"Uebertrag\",\"Total\")","v":"Total"},null,{"$f":"SUM(D58:D105)","v":0},{"$f":"SUM(E58:E105)","v":0},null,null,{"$f":"$H$5+D106-E106","v":0},null,null,null,null,{"$f":"IF(SUM($L$59:$L$105)<282,\"Einblenden\",\"Ausblenden\")","v":"Ausblenden"}]
[{"$f":"A1","v":"2023-04-04"},null,null,null,null,null,null,"Seite 3",null,null,null,null,{"$f":"IF(SUM($L$112:$L$158)<282,\"Einblenden\",\"Ausblenden\")","v":"Ausblenden"}]
[null,null,null,null,null,null,null,null,null,null,null,null,{"$f":"IF(SUM($L$112:$L$158)<282,\"Einblenden\",\"Ausblenden\")","v":"Ausblenden"}]
["Datum:","Text","FIBU","Einnahmen","Ausgaben",{"$f":"F3","v":"?"},null,"Saldo",null,null,null,null,{"$f":"IF(SUM($L$112:$L$158)<282,\"Einblenden\",\"Ausblenden\")","v":"Ausblenden"}]
[null,null,null,null,null,null,null,null,null,null,null,null,{"$f":"IF(SUM($L$112:$L$158)<282,\"Einblenden\",\"Ausblenden\")","v":"Ausblenden"}]
[null,"Uebertrag",null,{"$f":"D106","v":0},{"$f":"E106","v":0},null,null,{"$f":"H106","v":0},null,null,null,null,{"$f":"IF(SUM($L$112:$L$158)<282,\"Einblenden\",\"Ausblenden\")","v":"Ausblenden"}]
[null,null,null,null,null,null,95,{"$f":"IF(D112+E112=0,\" \",SUM($H$5+SUM($D$6:$D$52,$D$59:$D$105,$D$112:D112)-SUM($E$6:$E$52,$E$59:$E$105,$E$112:E112)))","v":" "},null,null,null,{"$f":"COUNTIF(A112:F112,\"\")","v":6},{"$f":"IF(L112<6,\"Einblenden\",\"Ausblenden\")","v":"Ausblenden"}]
[null,null,null,null,null,null,96,{"$f":"IF(D113+E113=0,\" \",SUM($H$5+SUM($D$6:$D$52,$D$59:$D$105,$D$112:D113)-SUM($E$6:$E$52,$E$59:$E$105,$E$112:E113)))","v":" "},null,null,null,{"$f":"COUNTIF(A113:F113,\"\")","v":6},"Ausblenden"]
[null,null,null,null,null,null,97,{"$f":"IF(D114+E114=0,\" \",SUM($H$5+SUM($D$6:$D$52,$D$59:$D$105,$D$112:D114)-SUM($E$6:$E$52,$E$59:$E$105,$E$112:E114)))","v":" "},null,null,null,6,"Ausblenden"]
[null,null,null,null,null,null,98,{"$f":"IF(D115+E115=0,\" \",SUM($H$5+SUM($D$6:$D$52,$D$59:$D$105,$D$112:D115)-SUM($E$6:$E$52,$E$59:$E$105,$E$112:E115)))","v":" "},null,null,null,6,"Ausblenden"]
[null,null,null,null,null,null,99,{"$f":"IF(D116+E116=0,\" \",SUM($H$5+SUM($D$6:$D$52,$D$59:$D$105,$D$112:D116)-SUM($E$6:$E$52,$E$59:$E$105,$E$112:E116)))","v":" "},null,null,null,6,"Ausblenden"]
[null,null,null,null,null,null,100,{"$f":"IF(D117+E117=0,\" \",SUM($H$5+SUM($D$6:$D$52,$D$59:$D$105,$D$112:D117)-SUM($E$6:$E$52,$E$59:$E$105,$E$112:E117)))","v":" "},null,null,null,6,"Ausblenden"]
[null,null,null,null,null,null,101,{"$f":"IF(D118+E118=0,\" \",SUM($H$5+SUM($D$6:$D$52,$D$59:$D$105,$D$112:D118)-SUM($E$6:$E$52,$E$59:$E$105,$E$112:E118)))","v":" "},null,null,null,6,"Ausblenden"]
[null,null,null,null,null,null,102,{"$f":"IF(D119+E119=0,\" \",SUM($H$5+SUM($D$6:$D$52,$D$59:$D$105,$D$112:D119)-SUM($E$6:$E$52,$E$59:$E$105,$E$112:E119)))","v":" "},null,null,null,6,"Ausblenden"]
[null,null,null,null,null,null,103,{"$f":"IF(D120+E120=0,\" \",SUM($H$5+SUM($D$6:$D$52,$D$59:$D$105,$D$112:D120)-SUM($E$6:$E$52,$E$59:$E$105,$E$112:E120)))","v":" "},null,null,null,6,"Ausblenden"]
[null,null,null,null,null,null,104,{"$f":"IF(D121+E121=0,\" \",SUM($H$5+SUM($D$6:$D$52,$D$59:$D$105,$D$112:D121)-SUM($E$6:$E$52,$E$59:$E$105,$E$112:E121)))","v":" "},null,null,null,6,"Ausblenden"]
[null,null,null,null,null,null,105,{"$f":"IF(D122+E122=0,\" \",SUM($H$5+SUM($D$6:$D$52,$D$59:$D$105,$D$112:D122)-SUM($E$6:$E$52,$E$59:$E$105,$E$112:E122)))","v":" "},null,null,null,6,"Ausblenden"]
[null,null,null,null,null,null,106,{"$f":"IF(D123+E123=0,\" \",SUM($H$5+SUM($D$6:$D$52,$D$59:$D$105,$D$112:D123)-SUM($E$6:$E$52,$E$59:$E$105,$E$112:E123)))","v":" "},null,null,null,6,"Ausblenden"]
[null,null,null,null,null,null,107,{"$f":"IF(D124+E124=0,\" \",SUM($H$5+SUM($D$6:$D$52,$D$59:$D$105,$D$112:D124)-SUM($E$6:$E$52,$E$59:$E$105,$E$112:E124)))","v":" "},null,null,null,6,"Ausblenden"]
[null,null,null,null,null,null,108,{"$f":"IF(D125+E125=0,\" \",SUM($H$5+SUM($D$6:$D$52,$D$59:$D$105,$D$112:D125)-SUM($E$6:$E$52,$E$59:$E$105,$E$112:E125)))","v":" "},null,null,null,6,"Ausblenden"]
[null,null,null,null,null,null,109,{"$f":"IF(D126+E126=0,\" \",SUM($H$5+SUM($D$6:$D$52,$D$59:$D$105,$D$112:D126)-SUM($E$6:$E$52,$E$59:$E$105,$E$112:E126)))","v":" "},null,null,null,6,"Ausblenden"]
[null,null,null,null,null,null,110,{"$f":"IF(D127+E127=0,\" \",SUM($H$5+SUM($D$6:$D$52,$D$59:$D$105,$D$112:D127)-SUM($E$6:$E$52,$E$59:$E$105,$E$112:E127)))","v":" "},null,null,null,6,"Ausblenden"]
[null,null,null,null,null,null,111,{"$f":"IF(D128+E128=0,\" \",SUM($H$5+SUM($D$6:$D$52,$D$59:$D$105,$D$112:D128)-SUM($E$6:$E$52,$E$59:$E$105,$E$112:E128)))","v":" "},null,null,null,6,"Ausblenden"]
[null,null,null,null,null,null,112,{"$f":"IF(D129+E129=0,\" \",SUM($H$5+SUM($D$6:$D$52,$D$59:$D$105,$D$112:D129)-SUM($E$6:$E$52,$E$59:$E$105,$E$112:E129)))","v":" "},null,null,null,6,"Ausblenden"]
[null,null,null,null,null,null,113,{"$f":"IF(D130+E130=0,\" \",SUM($H$5+SUM($D$6:$D$52,$D$59:$D$105,$D$112:D130)-SUM($E$6:$E$52,$E$59:$E$105,$E$112:E130)))","v":" "},null,null,null,6,"Ausblenden"]
[null,null,null,null,null,null,114,{"$f":"IF(D131+E131=0,\" \",SUM($H$5+SUM($D$6:$D$52,$D$59:$D$105,$D$112:D131)-SUM($E$6:$E$52,$E$59:$E$105,$E$112:E131)))","v":" "},null,null,null,6,"Ausblenden"]
[null,null,null,null,null,null,115,{"$f":"IF(D132+E132=0,\" \",SUM($H$5+SUM($D$6:$D$52,$D$59:$D$105,$D$112:D132)-SUM($E$6:$E$52,$E$59:$E$105,$E$112:E132)))","v":" "},null,null,null,6,"Ausblenden"]
[null,null,null,null,null,null,116,{"$f":"IF(D133+E133=0,\" \",SUM($H$5+SUM($D$6:$D$52,$D$59:$D$105,$D$112:D133)-SUM($E$6:$E$52,$E$59:$E$105,$E$112:E133)))","v":" "},null,null,null,6,"Ausblenden"]
[null,null,null,null,null,null,117,{"$f":"IF(D134+E134=0,\" \",SUM($H$5+SUM($D$6:$D$52,$D$59:$D$105,$D$112:D134)-SUM($E$6:$E$52,$E$59:$E$105,$E$112:E134)))","v":" "},null,null,null,6,"Ausblenden"]
[null,null,null,null,null,null,118,{"$f":"IF(D135+E135=0,\" \",SUM($H$5+SUM($D$6:$D$52,$D$59:$D$105,$D$112:D135)-SUM($E$6:$E$52,$E$59:$E$105,$E$112:E135)))","v":" "},null,null,null,6,"Ausblenden"]
[null,null,null,null,null,null,119,{"$f":"IF(D136+E136=0,\" \",SUM($H$5+SUM($D$6:$D$52,$D$59:$D$105,$D$112:D136)-SUM($E$6:$E$52,$E$59:$E$105,$E$112:E136)))","v":" "},null,null,null,6,"Ausblenden"]
[null,null,null,null,null,null,120,{"$f":"IF(D137+E137=0,\" \",SUM($H$5+SUM($D$6:$D$52,$D$59:$D$105,$D$112:D137)-SUM($E$6:$E$52,$E$59:$E$105,$E$112:E137)))","v":" "},null,null,null,6,"Ausblenden"]
[null,null,null,null,null,null,121,{"$f":"IF(D138+E138=0,\" \",SUM($H$5+SUM($D$6:$D$52,$D$59:$D$105,$D$112:D138)-SUM($E$6:$E$52,$E$59:$E$105,$E$112:E138)))","v":" "},null,null,null,6,"Ausblenden"]
[null,null,null,null,null,null,122,{"$f":"IF(D139+E139=0,\" \",SUM($H$5+SUM($D$6:$D$52,$D$59:$D$105,$D$112:D139)-SUM($E$6:$E$52,$E$59:$E$105,$E$112:E139)))","v":" "},null,null,null,6,"Ausblenden"]
[null,null,null,null,null,null,123,{"$f":"IF(D140+E140=0,\" \",SUM($H$5+SUM($D$6:$D$52,$D$59:$D$105,$D$112:D140)-SUM($E$6:$E$52,$E$59:$E$105,$E$112:E140)))","v":" "},null,null,null,6,"Ausblenden"]
[null,null,null,null,null,null,124,{"$f":"IF(D141+E141=0,\" \",SUM($H$5+SUM($D$6:$D$52,$D$59:$D$105,$D$112:D141)-SUM($E$6:$E$52,$E$59:$E$105,$E$112:E141)))","v":" "},null,null,null,6,"Ausblenden"]
[null,null,null,null,null,null,125,{"$f":"IF(D142+E142=0,\" \",SUM($H$5+SUM($D$6:$D$52,$D$59:$D$105,$D$112:D142)-SUM($E$6:$E$52,$E$59:$E$105,$E$112:E142)))","v":" "},null,null,null,6,"Ausblenden"]
[null,null,null,null,null,null,126,{"$f":"IF(D143+E143=0,\" \",SUM($H$5+SUM($D$6:$D$52,$D$59:$D$105,$D$112:D143)-SUM($E$6:$E$52,$E$59:$E$105,$E$112:E143)))","v":" "},null,null,null,6,"Ausblenden"]
[null,null,null,null,null,null,127,{"$f":"IF(D144+E144=0,\" \",SUM($H$5+SUM($D$6:$D$52,$D$59:$D$105,$D$112:D144)-SUM($E$6:$E$52,$E$59:$E$105,$E$112:E144)))","v":" "},null,null,null,6,"Ausblenden"]
[null,null,null,null,null,null,128,{"$f":"IF(D145+E145=0,\" \",SUM($H$5+SUM($D$6:$D$52,$D$59:$D$105,$D$112:D145)-SUM($E$6:$E$52,$E$59:$E$105,$E$112:E145)))","v":" "},null,null,null,6,"Ausblenden"]
[null,null,null,null,null,null,129,{"$f":"IF(D146+E146=0,\" \",SUM($H$5+SUM($D$6:$D$52,$D$59:$D$105,$D$112:D146)-SUM($E$6:$E$52,$E$59:$E$105,$E$112:E146)))","v":" "},null,null,null,6,"Ausblenden"]
[null,null,null,null,null,null,130,{"$f":"IF(D147+E147=0,\" \",SUM($H$5+SUM($D$6:$D$52,$D$59:$D$105,$D$112:D147)-SUM($E$6:$E$52,$E$59:$E$105,$E$112:E147)))","v":" "},null,null,null,6,"Ausblenden"]
[null,null,null,null,null,null,131,{"$f":"IF(D148+E148=0,\" \",SUM($H$5+SUM($D$6:$D$52,$D$59:$D$105,$D$112:D148)-SUM($E$6:$E$52,$E$59:$E$105,$E$112:E148)))","v":" "},null,null,null,6,"Ausblenden"]
[null,null,null,null,null,null,132,{"$f":"IF(D149+E149=0,\" \",SUM($H$5+SUM($D$6:$D$52,$D$59:$D$105,$D$112:D149)-SUM($E$6:$E$52,$E$59:$E$105,$E$112:E149)))","v":" "},null,null,null,6,"Ausblenden"]
[null,null,null,null,null,null,133,{"$f":"IF(D150+E150=0,\" \",SUM($H$5+SUM($D$6:$D$52,$D$59:$D$105,$D$112:D150)-SUM($E$6:$E$52,$E$59:$E$105,$E$112:E150)))","v":" "},null,null,null,6,"Ausblenden"]
[null,null,null,null,null,null,134,{"$f":"IF(D151+E151=0,\" \",SUM($H$5+SUM($D$6:$D$52,$D$59:$D$105,$D$112:D151)-SUM($E$6:$E$52,$E$59:$E$105,$E$112:E151)))","v":" "},null,null,null,6,"Ausblenden"]
[null,null,null,null,null,null,135,{"$f":"IF(D152+E152=0,\" \",SUM($H$5+SUM($D$6:$D$52,$D$59:$D$105,$D$112:D152)-SUM($E$6:$E$52,$E$59:$E$105,$E$112:E152)))","v":" "},null,null,null,6,"Ausblenden"]
[null,null,null,null,null,null,136,{"$f":"IF(D153+E153=0,\" \",SUM($H$5+SUM($D$6:$D$52,$D$59:$D$105,$D$112:D153)-SUM($E$6:$E$52,$E$59:$E$105,$E$112:E153)))","v":" "},null,null,null,6,"Ausblenden"]
[null,null,null,null,null,null,137,{"$f":"IF(D154+E154=0,\" \",SUM($H$5+SUM($D$6:$D$52,$D$59:$D$105,$D$112:D154)-SUM($E$6:$E$52,$E$59:$E$105,$E$112:E154)))","v":" "},null,null,null,6,"Ausblenden"]
[null,null,null,null,null,null,138,{"$f":"IF(D155+E155=0,\" \",SUM($H$5+SUM($D$6:$D$52,$D$59:$D$105,$D$112:D155)-SUM($E$6:$E$52,$E$59:$E$105,$E$112:E155)))","v":" "},null,null,null,6,"Ausblenden"]
[null,null,null,null,null,null,139,{"$f":"IF(D156+E156=0,\" \",SUM($H$5+SUM($D$6:$D$52,$D$59:$D$105,$D$112:D156)-SUM($E$6:$E$52,$E$59:$E$105,$E$112:E156)))","v":" "},null,null,null,6,"Ausblenden"]
[null,null,null,null,null,null,140,{"$f":"IF(D157+E157=0,\" \",SUM($H$5+SUM($D$6:$D$52,$D$59:$D$105,$D$112:D157)-SUM($E$6:$E$52,$E$59:$E$105,$E$112:E157)))","v":" "},null,null,null,6,"Ausblenden"]
[null,null,null,null,null,null,141,{"$f":"IF(D158+E158=0,\" \",SUM($H$5+SUM($D$6:$D$52,$D$59:$D$105,$D$112:D158)-SUM($E$6:$E$52,$E$59:$E$105,$E$112:E158)))","v":" "},null,null,null,6,"Ausblenden"]
[null,"Total",null,{"$f":"SUM(D111:D158)","v":0},{"$f":"SUM(E111:E158)","v":0},null,null,{"$f":"$H$5+D159-E159","v":0},null,null,null,null,{"$f":"IF(SUM($L$112:$L$158)<282,\"Einblenden\",\"Ausblenden\")","v":"Ausblenden"}]

{"sheet":"Mai","index":5,"n_rows":159,"n_cols":13,"rows_kept":159,"cut":false,"hidden":false,"merged":[]}
[{"$f":"April!A1+31","v":"2023-05-05"}]
[]
["Datum:","Text","FIBU","Einnahmen","Ausgaben",{"$f":"Januar!F3","v":"?"},null,"Saldo"]
[]
[1,"Saldovortrag",null,null,null,null,null,{"$f":"SUM(April!H159)","v":0}]
[null,null,null,null,null,null,1,{"$f":"IF(D6+E6=0,\" \",SUM($H$5+SUM($D$6:D6)-SUM($E$6:E6)))","v":" "},null,null,null,null,"Einblenden"]
[null,null,null,null,null,null,2,{"$f":"IF(D7+E7=0,\" \",SUM($H$5+SUM($D$6:D7)-SUM($E$6:E7)))","v":" "},null,null,null,{"$f":"COUNTIF(A7:F7,\"\")","v":6},{"$f":"IF(L7<6,\"Einblenden\",\"Ausblenden\")","v":"Ausblenden"}]
[null,null,null,null,null,null,3,{"$f":"IF(D8+E8=0,\" \",SUM($H$5+SUM($D$6:D8)-SUM($E$6:E8)))","v":" "},null,null,null,{"$f":"COUNTIF(A8:F8,\"\")","v":6},{"$f":"IF(L8<6,\"Einblenden\",\"Ausblenden\")","v":"Ausblenden"}]
[null,null,null,null,null,null,4,{"$f":"IF(D9+E9=0,\" \",SUM($H$5+SUM($D$6:D9)-SUM($E$6:E9)))","v":" "},null,null,null,6,"Ausblenden"]
[null,null,null,null,null,null,5,{"$f":"IF(D10+E10=0,\" \",SUM($H$5+SUM($D$6:D10)-SUM($E$6:E10)))","v":" "},null,null,null,6,"Ausblenden"]
[null,null,null,null,null,null,6,{"$f":"IF(D11+E11=0,\" \",SUM($H$5+SUM($D$6:D11)-SUM($E$6:E11)))","v":" "},null,null,null,6,"Ausblenden"]
[null,null,null,null,null,null,7,{"$f":"IF(D12+E12=0,\" \",SUM($H$5+SUM($D$6:D12)-SUM($E$6:E12)))","v":" "},null,null,null,6,"Ausblenden"]
[null,null,null,null,null,null,8,{"$f":"IF(D13+E13=0,\" \",SUM($H$5+SUM($D$6:D13)-SUM($E$6:E13)))","v":" "},null,null,null,6,"Ausblenden"]
[null,null,null,null,null,null,9,{"$f":"IF(D14+E14=0,\" \",SUM($H$5+SUM($D$6:D14)-SUM($E$6:E14)))","v":" "},null,null,null,6,"Ausblenden"]
[null,null,null,null,null,null,10,{"$f":"IF(D15+E15=0,\" \",SUM($H$5+SUM($D$6:D15)-SUM($E$6:E15)))","v":" "},null,null,null,6,"Ausblenden"]
[null,null,null,null,null,null,11,{"$f":"IF(D16+E16=0,\" \",SUM($H$5+SUM($D$6:D16)-SUM($E$6:E16)))","v":" "},null,null,null,6,"Ausblenden"]
[null,null,null,null,null,null,12,{"$f":"IF(D17+E17=0,\" \",SUM($H$5+SUM($D$6:D17)-SUM($E$6:E17)))","v":" "},null,null,null,6,"Ausblenden"]
[null,null,null,null,null,null,13,{"$f":"IF(D18+E18=0,\" \",SUM($H$5+SUM($D$6:D18)-SUM($E$6:E18)))","v":" "},null,null,null,6,"Ausblenden"]
[null,null,null,null,null,null,14,{"$f":"IF(D19+E19=0,\" \",SUM($H$5+SUM($D$6:D19)-SUM($E$6:E19)))","v":" "},null,null,null,6,"Ausblenden"]
[null,null,null,null,null,null,15,{"$f":"IF(D20+E20=0,\" \",SUM($H$5+SUM($D$6:D20)-SUM($E$6:E20)))","v":" "},null,null,null,6,"Ausblenden"]
[null,null,null,null,null,null,16,{"$f":"IF(D21+E21=0,\" \",SUM($H$5+SUM($D$6:D21)-SUM($E$6:E21)))","v":" "},null,null,null,6,"Ausblenden"]
[null,null,null,null,null,null,17,{"$f":"IF(D22+E22=0,\" \",SUM($H$5+SUM($D$6:D22)-SUM($E$6:E22)))","v":" "},null,null,null,6,"Ausblenden"]
[null,null,null,null,null,null,18,{"$f":"IF(D23+E23=0,\" \",SUM($H$5+SUM($D$6:D23)-SUM($E$6:E23)))","v":" "},null,null,null,6,"Ausblenden"]
[null,null,null,null,null,null,19,{"$f":"IF(D24+E24=0,\" \",SUM($H$5+SUM($D$6:D24)-SUM($E$6:E24)))","v":" "},null,null,null,6,"Ausblenden"]
[null,null,null,null,null,null,20,{"$f":"IF(D25+E25=0,\" \",SUM($H$5+SUM($D$6:D25)-SUM($E$6:E25)))","v":" "},null,null,null,6,"Ausblenden"]
[null,null,null,null,null,null,21,{"$f":"IF(D26+E26=0,\" \",SUM($H$5+SUM($D$6:D26)-SUM($E$6:E26)))","v":" "},null,null,null,6,"Ausblenden"]
[null,null,null,null,null,null,22,{"$f":"IF(D27+E27=0,\" \",SUM($H$5+SUM($D$6:D27)-SUM($E$6:E27)))","v":" "},null,null,null,6,"Ausblenden"]
[null,null,null,null,null,null,23,{"$f":"IF(D28+E28=0,\" \",SUM($H$5+SUM($D$6:D28)-SUM($E$6:E28)))","v":" "},null,null,null,6,"Ausblenden"]
[null,null,null,null,null,null,24,{"$f":"IF(D29+E29=0,\" \",SUM($H$5+SUM($D$6:D29)-SUM($E$6:E29)))","v":" "},null,null,null,6,"Ausblenden"]
[null,null,null,null,null,null,25,{"$f":"IF(D30+E30=0,\" \",SUM($H$5+SUM($D$6:D30)-SUM($E$6:E30)))","v":" "},null,null,null,6,"Ausblenden"]
[null,null,null,null,null,null,26,{"$f":"IF(D31+E31=0,\" \",SUM($H$5+SUM($D$6:D31)-SUM($E$6:E31)))","v":" "},null,null,null,6,"Ausblenden"]
[null,null,null,null,null,null,27,{"$f":"IF(D32+E32=0,\" \",SUM($H$5+SUM($D$6:D32)-SUM($E$6:E32)))","v":" "},null,null,null,6,"Ausblenden"]
[null,null,null,null,null,null,28,{"$f":"IF(D33+E33=0,\" \",SUM($H$5+SUM($D$6:D33)-SUM($E$6:E33)))","v":" "},null,null,null,6,"Ausblenden"]
[null,null,null,null,null,null,29,{"$f":"IF(D34+E34=0,\" \",SUM($H$5+SUM($D$6:D34)-SUM($E$6:E34)))","v":" "},null,null,null,6,"Ausblenden"]
[null,null,null,null,null,null,30,{"$f":"IF(D35+E35=0,\" \",SUM($H$5+SUM($D$6:D35)-SUM($E$6:E35)))","v":" "},null,null,null,6,"Ausblenden"]
[null,null,null,null,null,null,31,{"$f":"IF(D36+E36=0,\" \",SUM($H$5+SUM($D$6:D36)-SUM($E$6:E36)))","v":" "},null,null,null,6,"Ausblenden"]
[null,null,null,null,null,null,32,{"$f":"IF(D37+E37=0,\" \",SUM($H$5+SUM($D$6:D37)-SUM($E$6:E37)))","v":" "},null,null,null,6,"Ausblenden"]
[null,null,null,null,null,null,33,{"$f":"IF(D38+E38=0,\" \",SUM($H$5+SUM($D$6:D38)-SUM($E$6:E38)))","v":" "},null,null,null,6,"Ausblenden"]
[null,null,null,null,null,null,34,{"$f":"IF(D39+E39=0,\" \",SUM($H$5+SUM($D$6:D39)-SUM($E$6:E39)))","v":" "},null,null,null,6,"Ausblenden"]
[null,null,null,null,null,null,35,{"$f":"IF(D40+E40=0,\" \",SUM($H$5+SUM($D$6:D40)-SUM($E$6:E40)))","v":" "},null,null,null,6,"Ausblenden"]
[null,null,null,null,null,null,36,{"$f":"IF(D41+E41=0,\" \",SUM($H$5+SUM($D$6:D41)-SUM($E$6:E41)))","v":" "},null,null,null,6,"Ausblenden"]
[null,null,null,null,null,null,37,{"$f":"IF(D42+E42=0,\" \",SUM($H$5+SUM($D$6:D42)-SUM($E$6:E42)))","v":" "},null,null,null,6,"Ausblenden"]
[null,null,null,null,null,null,38,{"$f":"IF(D43+E43=0,\" \",SUM($H$5+SUM($D$6:D43)-SUM($E$6:E43)))","v":" "},null,null,null,6,"Ausblenden"]
[null,null,null,null,null,null,39,{"$f":"IF(D44+E44=0,\" \",SUM($H$5+SUM($D$6:D44)-SUM($E$6:E44)))","v":" "},null,null,null,6,"Ausblenden"]
[null,null,null,null,null,null,40,{"$f":"IF(D45+E45=0,\" \",SUM($H$5+SUM($D$6:D45)-SUM($E$6:E45)))","v":" "},null,null,null,6,"Ausblenden"]
[null,null,null,null,null,null,41,{"$f":"IF(D46+E46=0,\" \",SUM($H$5+SUM($D$6:D46)-SUM($E$6:E46)))","v":" "},null,null,null,6,"Ausblenden"]
[null,null,null,null,null,null,42,{"$f":"IF(D47+E47=0,\" \",SUM($H$5+SUM($D$6:D47)-SUM($E$6:E47)))","v":" "},null,null,null,6,"Ausblenden"]
[null,null,null,null,null,null,43,{"$f":"IF(D48+E48=0,\" \",SUM($H$5+SUM($D$6:D48)-SUM($E$6:E48)))","v":" "},null,null,null,6,"Ausblenden"]
[null,null,null,null,null,null,44,{"$f":"IF(D49+E49=0,\" \",SUM($H$5+SUM($D$6:D49)-SUM($E$6:E49)))","v":" "},null,null,null,6,"Ausblenden"]
[null,null,null,null,null,null,45,{"$f":"IF(D50+E50=0,\" \",SUM($H$5+SUM($D$6:D50)-SUM($E$6:E50)))","v":" "},null,null,null,6,"Ausblenden"]
[null,null,null,null,null,null,46,{"$f":"IF(D51+E51=0,\" \",SUM($H$5+SUM($D$6:D51)-SUM($E$6:E51)))","v":" "},null,null,null,6,"Ausblenden"]
[null,null,null,null,null,null,47,{"$f":"IF(D52+E52=0,\" \",SUM($H$5+SUM($D$6:D52)-SUM($E$6:E52)))","v":" "},null,null,null,6,"Ausblenden"]
[null,{"$f":"IF(SUM(D59:E105)<>0,\"Uebertrag\",\"Total\")","v":"Total"},null,{"$f":"SUM(D5:D52)","v":0},{"$f":"SUM(E5:E52)","v":0},null,null,{"$f":"H5+D53-E53","v":0},null,null,null,null,"Einblenden"]
[{"$f":"A1","v":"2023-05-05"},null,null,null,null,null,null,"Seite 2",null,null,null,null,{"$f":"IF(SUM($L$59:$L$105)<282,\"Einblenden\",\"Ausblenden\")","v":"Ausblenden"}]
[null,null,null,null,null,null,null,null,null,null,null,null,{"$f":"IF(SUM($L$59:$L$105)<282,\"Einblenden\",\"Ausblenden\")","v":"Ausblenden"}]
["Datum:","Text","FIBU","Einnahmen","Ausgaben",{"$f":"F3","v":"?"},null,"Saldo",null,null,null,null,{"$f":"IF(SUM($L$59:$L$105)<282,\"Einblenden\",\"Ausblenden\")","v":"Ausblenden"}]
[null,null,null,null,null,null,null,null,null,null,null,null,{"$f":"IF(SUM($L$59:$L$105)<282,\"Einblenden\",\"Ausblenden\")","v":"Ausblenden"}]
[null,"Uebertrag",null,{"$f":"D53","v":0},{"$f":"E53","v":0},null,null,{"$f":"H53","v":0},null,null,null,null,{"$f":"IF(SUM($L$59:$L$105)<282,\"Einblenden\",\"Ausblenden\")","v":"Ausblenden"}]
[null,null,null,null,null,null,48,{"$f":"IF(D59+E59=0,\" \",SUM($H$5+SUM($D$6:$D$52,$D$59:D59)-SUM($E$6:$E$52,$E$59:E59)))","v":" "},null,null,null,{"$f":"COUNTIF(A59:F59,\"\")","v":6},{"$f":"IF(L59<6,\"Einblenden\",\"Ausblenden\")","v":"Ausblenden"}]
[null,null,null,null,null,null,49,{"$f":"IF(D60+E60=0,\" \",SUM($H$5+SUM($D$6:$D$52,$D$59:D60)-SUM($E$6:$E$52,$E$59:E60)))","v":" "},null,null,null,{"$f":"COUNTIF(A60:F60,\"\")","v":6},{"$f":"IF(L60<6,\"Einblenden\",\"Ausblenden\")","v":"Ausblenden"}]
[null,null,null,null,null,null,50,{"$f":"IF(D61+E61=0,\" \",SUM($H$5+SUM($D$6:$D$52,$D$59:D61)-SUM($E$6:$E$52,$E$59:E61)))","v":" "},null,null,null,6,"Ausblenden"]
[null,null,null,null,null,null,51,{"$f":"IF(D62+E62=0,\" \",SUM($H$5+SUM($D$6:$D$52,$D$59:D62)-SUM($E$6:$E$52,$E$59:E62)))","v":" "},null,null,null,6,"Ausblenden"]
[null,null,null,null,null,null,52,{"$f":"IF(D63+E63=0,\" \",SUM($H$5+SUM($D$6:$D$52,$D$59:D63)-SUM($E$6:$E$52,$E$59:E63)))","v":" "},null,null,null,6,"Ausblenden"]
[null,null,null,null,null,null,53,{"$f":"IF(D64+E64=0,\" \",SUM($H$5+SUM($D$6:$D$52,$D$59:D64)-SUM($E$6:$E$52,$E$59:E64)))","v":" "},null,null,null,6,"Ausblenden"]
[null,null,null,null,null,null,54,{"$f":"IF(D65+E65=0,\" \",SUM($H$5+SUM($D$6:$D$52,$D$59:D65)-SUM($E$6:$E$52,$E$59:E65)))","v":" "},null,null,null,6,"Ausblenden"]
[null,null,null,null,null,null,55,{"$f":"IF(D66+E66=0,\" \",SUM($H$5+SUM($D$6:$D$52,$D$59:D66)-SUM($E$6:$E$52,$E$59:E66)))","v":" "},null,null,null,6,"Ausblenden"]
[null,null,null,null,null,null,56,{"$f":"IF(D67+E67=0,\" \",SUM($H$5+SUM($D$6:$D$52,$D$59:D67)-SUM($E$6:$E$52,$E$59:E67)))","v":" "},null,null,null,6,"Ausblenden"]
[null,null,null,null,null,null,57,{"$f":"IF(D68+E68=0,\" \",SUM($H$5+SUM($D$6:$D$52,$D$59:D68)-SUM($E$6:$E$52,$E$59:E68)))","v":" "},null,null,null,6,"Ausblenden"]
[null,null,null,null,null,null,58,{"$f":"IF(D69+E69=0,\" \",SUM($H$5+SUM($D$6:$D$52,$D$59:D69)-SUM($E$6:$E$52,$E$59:E69)))","v":" "},null,null,null,6,"Ausblenden"]
[null,null,null,null,null,null,59,{"$f":"IF(D70+E70=0,\" \",SUM($H$5+SUM($D$6:$D$52,$D$59:D70)-SUM($E$6:$E$52,$E$59:E70)))","v":" "},null,null,null,6,"Ausblenden"]
[null,null,null,null,null,null,60,{"$f":"IF(D71+E71=0,\" \",SUM($H$5+SUM($D$6:$D$52,$D$59:D71)-SUM($E$6:$E$52,$E$59:E71)))","v":" "},null,null,null,6,"Ausblenden"]
[null,null,null,null,null,null,61,{"$f":"IF(D72+E72=0,\" \",SUM($H$5+SUM($D$6:$D$52,$D$59:D72)-SUM($E$6:$E$52,$E$59:E72)))","v":" "},null,null,null,6,"Ausblenden"]
[null,null,null,null,null,null,62,{"$f":"IF(D73+E73=0,\" \",SUM($H$5+SUM($D$6:$D$52,$D$59:D73)-SUM($E$6:$E$52,$E$59:E73)))","v":" "},null,null,null,6,"Ausblenden"]
[null,null,null,null,null,null,63,{"$f":"IF(D74+E74=0,\" \",SUM($H$5+SUM($D$6:$D$52,$D$59:D74)-SUM($E$6:$E$52,$E$59:E74)))","v":" "},null,null,null,6,"Ausblenden"]
[null,null,null,null,null,null,64,{"$f":"IF(D75+E75=0,\" \",SUM($H$5+SUM($D$6:$D$52,$D$59:D75)-SUM($E$6:$E$52,$E$59:E75)))","v":" "},null,null,null,6,"Ausblenden"]
[null,null,null,null,null,null,65,{"$f":"IF(D76+E76=0,\" \",SUM($H$5+SUM($D$6:$D$52,$D$59:D76)-SUM($E$6:$E$52,$E$59:E76)))","v":" "},null,null,null,6,"Ausblenden"]
[null,null,null,null,null,null,66,{"$f":"IF(D77+E77=0,\" \",SUM($H$5+SUM($D$6:$D$52,$D$59:D77)-SUM($E$6:$E$52,$E$59:E77)))","v":" "},null,null,null,6,"Ausblenden"]
[null,null,null,null,null,null,67,{"$f":"IF(D78+E78=0,\" \",SUM($H$5+SUM($D$6:$D$52,$D$59:D78)-SUM($E$6:$E$52,$E$59:E78)))","v":" "},null,null,null,6,"Ausblenden"]
[null,null,null,null,null,null,68,{"$f":"IF(D79+E79=0,\" \",SUM($H$5+SUM($D$6:$D$52,$D$59:D79)-SUM($E$6:$E$52,$E$59:E79)))","v":" "},null,null,null,6,"Ausblenden"]
[null,null,null,null,null,null,69,{"$f":"IF(D80+E80=0,\" \",SUM($H$5+SUM($D$6:$D$52,$D$59:D80)-SUM($E$6:$E$52,$E$59:E80)))","v":" "},null,null,null,6,"Ausblenden"]
[null,null,null,null,null,null,70,{"$f":"IF(D81+E81=0,\" \",SUM($H$5+SUM($D$6:$D$52,$D$59:D81)-SUM($E$6:$E$52,$E$59:E81)))","v":" "},null,null,null,6,"Ausblenden"]
[null,null,null,null,null,null,71,{"$f":"IF(D82+E82=0,\" \",SUM($H$5+SUM($D$6:$D$52,$D$59:D82)-SUM($E$6:$E$52,$E$59:E82)))","v":" "},null,null,null,6,"Ausblenden"]
[null,null,null,null,null,null,72,{"$f":"IF(D83+E83=0,\" \",SUM($H$5+SUM($D$6:$D$52,$D$59:D83)-SUM($E$6:$E$52,$E$59:E83)))","v":" "},null,null,null,6,"Ausblenden"]
[null,null,null,null,null,null,73,{"$f":"IF(D84+E84=0,\" \",SUM($H$5+SUM($D$6:$D$52,$D$59:D84)-SUM($E$6:$E$52,$E$59:E84)))","v":" "},null,null,null,6,"Ausblenden"]
[null,null,null,null,null,null,74,{"$f":"IF(D85+E85=0,\" \",SUM($H$5+SUM($D$6:$D$52,$D$59:D85)-SUM($E$6:$E$52,$E$59:E85)))","v":" "},null,null,null,6,"Ausblenden"]
[null,null,null,null,null,null,75,{"$f":"IF(D86+E86=0,\" \",SUM($H$5+SUM($D$6:$D$52,$D$59:D86)-SUM($E$6:$E$52,$E$59:E86)))","v":" "},null,null,null,6,"Ausblenden"]
[null,null,null,null,null,null,76,{"$f":"IF(D87+E87=0,\" \",SUM($H$5+SUM($D$6:$D$52,$D$59:D87)-SUM($E$6:$E$52,$E$59:E87)))","v":" "},null,null,null,6,"Ausblenden"]
[null,null,null,null,null,null,77,{"$f":"IF(D88+E88=0,\" \",SUM($H$5+SUM($D$6:$D$52,$D$59:D88)-SUM($E$6:$E$52,$E$59:E88)))","v":" "},null,null,null,6,"Ausblenden"]
[null,null,null,null,null,null,78,{"$f":"IF(D89+E89=0,\" \",SUM($H$5+SUM($D$6:$D$52,$D$59:D89)-SUM($E$6:$E$52,$E$59:E89)))","v":" "},null,null,null,6,"Ausblenden"]
[null,null,null,null,null,null,79,{"$f":"IF(D90+E90=0,\" \",SUM($H$5+SUM($D$6:$D$52,$D$59:D90)-SUM($E$6:$E$52,$E$59:E90)))","v":" "},null,null,null,6,"Ausblenden"]
[null,null,null,null,null,null,80,{"$f":"IF(D91+E91=0,\" \",SUM($H$5+SUM($D$6:$D$52,$D$59:D91)-SUM($E$6:$E$52,$E$59:E91)))","v":" "},null,null,null,6,"Ausblenden"]
[null,null,null,null,null,null,81,{"$f":"IF(D92+E92=0,\" \",SUM($H$5+SUM($D$6:$D$52,$D$59:D92)-SUM($E$6:$E$52,$E$59:E92)))","v":" "},null,null,null,6,"Ausblenden"]
[null,null,null,null,null,null,82,{"$f":"IF(D93+E93=0,\" \",SUM($H$5+SUM($D$6:$D$52,$D$59:D93)-SUM($E$6:$E$52,$E$59:E93)))","v":" "},null,null,null,6,"Ausblenden"]
[null,null,null,null,null,null,83,{"$f":"IF(D94+E94=0,\" \",SUM($H$5+SUM($D$6:$D$52,$D$59:D94)-SUM($E$6:$E$52,$E$59:E94)))","v":" "},null,null,null,6,"Ausblenden"]
[null,null,null,null,null,null,84,{"$f":"IF(D95+E95=0,\" \",SUM($H$5+SUM($D$6:$D$52,$D$59:D95)-SUM($E$6:$E$52,$E$59:E95)))","v":" "},null,null,null,6,"Ausblenden"]
[null,null,null,null,null,null,85,{"$f":"IF(D96+E96=0,\" \",SUM($H$5+SUM($D$6:$D$52,$D$59:D96)-SUM($E$6:$E$52,$E$59:E96)))","v":" "},null,null,null,6,"Ausblenden"]
[null,null,null,null,null,null,86,{"$f":"IF(D97+E97=0,\" \",SUM($H$5+SUM($D$6:$D$52,$D$59:D97)-SUM($E$6:$E$52,$E$59:E97)))","v":" "},null,null,null,6,"Ausblenden"]
[null,null,null,null,null,null,87,{"$f":"IF(D98+E98=0,\" \",SUM($H$5+SUM($D$6:$D$52,$D$59:D98)-SUM($E$6:$E$52,$E$59:E98)))","v":" "},null,null,null,6,"Ausblenden"]
[null,null,null,null,null,null,88,{"$f":"IF(D99+E99=0,\" \",SUM($H$5+SUM($D$6:$D$52,$D$59:D99)-SUM($E$6:$E$52,$E$59:E99)))","v":" "},null,null,null,6,"Ausblenden"]
[null,null,null,null,null,null,89,{"$f":"IF(D100+E100=0,\" \",SUM($H$5+SUM($D$6:$D$52,$D$59:D100)-SUM($E$6:$E$52,$E$59:E100)))","v":" "},null,null,null,6,"Ausblenden"]
[null,null,null,null,null,null,90,{"$f":"IF(D101+E101=0,\" \",SUM($H$5+SUM($D$6:$D$52,$D$59:D101)-SUM($E$6:$E$52,$E$59:E101)))","v":" "},null,null,null,6,"Ausblenden"]
[null,null,null,null,null,null,91,{"$f":"IF(D102+E102=0,\" \",SUM($H$5+SUM($D$6:$D$52,$D$59:D102)-SUM($E$6:$E$52,$E$59:E102)))","v":" "},null,null,null,6,"Ausblenden"]
[null,null,null,null,null,null,92,{"$f":"IF(D103+E103=0,\" \",SUM($H$5+SUM($D$6:$D$52,$D$59:D103)-SUM($E$6:$E$52,$E$59:E103)))","v":" "},null,null,null,6,"Ausblenden"]
[null,null,null,null,null,null,93,{"$f":"IF(D104+E104=0,\" \",SUM($H$5+SUM($D$6:$D$52,$D$59:D104)-SUM($E$6:$E$52,$E$59:E104)))","v":" "},null,null,null,6,"Ausblenden"]
[null,null,null,null,null,null,94,{"$f":"IF(D105+E105=0,\" \",SUM($H$5+SUM($D$6:$D$52,$D$59:D105)-SUM($E$6:$E$52,$E$59:E105)))","v":" "},null,null,null,{"$f":"COUNTIF(A105:F105,\"\")","v":6},"Ausblenden"]
[null,{"$f":"IF(SUM(D112:E158)<>0,\"Uebertrag\",\"Total\")","v":"Total"},null,{"$f":"SUM(D58:D105)","v":0},{"$f":"SUM(E58:E105)","v":0},null,null,{"$f":"$H$5+D106-E106","v":0},null,null,null,null,{"$f":"IF(SUM($L$59:$L$105)<282,\"Einblenden\",\"Ausblenden\")","v":"Ausblenden"}]
[{"$f":"A1","v":"2023-05-05"},null,null,null,null,null,null,"Seite 3",null,null,null,null,{"$f":"IF(SUM($L$112:$L$158)<282,\"Einblenden\",\"Ausblenden\")","v":"Ausblenden"}]
[null,null,null,null,null,null,null,null,null,null,null,null,{"$f":"IF(SUM($L$112:$L$158)<282,\"Einblenden\",\"Ausblenden\")","v":"Ausblenden"}]
["Datum:","Text","FIBU","Einnahmen","Ausgaben",{"$f":"F3","v":"?"},null,"Saldo",null,null,null,null,{"$f":"IF(SUM($L$112:$L$158)<282,\"Einblenden\",\"Ausblenden\")","v":"Ausblenden"}]
[null,null,null,null,null,null,null,null,null,null,null,null,{"$f":"IF(SUM($L$112:$L$158)<282,\"Einblenden\",\"Ausblenden\")","v":"Ausblenden"}]
[null,"Uebertrag",null,{"$f":"D106","v":0},{"$f":"E106","v":0},null,null,{"$f":"H106","v":0},null,null,null,null,{"$f":"IF(SUM($L$112:$L$158)<282,\"Einblenden\",\"Ausblenden\")","v":"Ausblenden"}]
[null,null,null,null,null,null,95,{"$f":"IF(D112+E112=0,\" \",SUM($H$5+SUM($D$6:$D$52,$D$59:$D$105,$D$112:D112)-SUM($E$6:$E$52,$E$59:$E$105,$E$112:E112)))","v":" "},null,null,null,{"$f":"COUNTIF(A112:F112,\"\")","v":6},{"$f":"IF(L112<6,\"Einblenden\",\"Ausblenden\")","v":"Ausblenden"}]
[null,null,null,null,null,null,96,{"$f":"IF(D113+E113=0,\" \",SUM($H$5+SUM($D$6:$D$52,$D$59:$D$105,$D$112:D113)-SUM($E$6:$E$52,$E$59:$E$105,$E$112:E113)))","v":" "},null,null,null,{"$f":"COUNTIF(A113:F113,\"\")","v":6},"Ausblenden"]
[null,null,null,null,null,null,97,{"$f":"IF(D114+E114=0,\" \",SUM($H$5+SUM($D$6:$D$52,$D$59:$D$105,$D$112:D114)-SUM($E$6:$E$52,$E$59:$E$105,$E$112:E114)))","v":" "},null,null,null,6,"Ausblenden"]
[null,null,null,null,null,null,98,{"$f":"IF(D115+E115=0,\" \",SUM($H$5+SUM($D$6:$D$52,$D$59:$D$105,$D$112:D115)-SUM($E$6:$E$52,$E$59:$E$105,$E$112:E115)))","v":" "},null,null,null,6,"Ausblenden"]
[null,null,null,null,null,null,99,{"$f":"IF(D116+E116=0,\" \",SUM($H$5+SUM($D$6:$D$52,$D$59:$D$105,$D$112:D116)-SUM($E$6:$E$52,$E$59:$E$105,$E$112:E116)))","v":" "},null,null,null,6,"Ausblenden"]
[null,null,null,null,null,null,100,{"$f":"IF(D117+E117=0,\" \",SUM($H$5+SUM($D$6:$D$52,$D$59:$D$105,$D$112:D117)-SUM($E$6:$E$52,$E$59:$E$105,$E$112:E117)))","v":" "},null,null,null,6,"Ausblenden"]
[null,null,null,null,null,null,101,{"$f":"IF(D118+E118=0,\" \",SUM($H$5+SUM($D$6:$D$52,$D$59:$D$105,$D$112:D118)-SUM($E$6:$E$52,$E$59:$E$105,$E$112:E118)))","v":" "},null,null,null,6,"Ausblenden"]
[null,null,null,null,null,null,102,{"$f":"IF(D119+E119=0,\" \",SUM($H$5+SUM($D$6:$D$52,$D$59:$D$105,$D$112:D119)-SUM($E$6:$E$52,$E$59:$E$105,$E$112:E119)))","v":" "},null,null,null,6,"Ausblenden"]
[null,null,null,null,null,null,103,{"$f":"IF(D120+E120=0,\" \",SUM($H$5+SUM($D$6:$D$52,$D$59:$D$105,$D$112:D120)-SUM($E$6:$E$52,$E$59:$E$105,$E$112:E120)))","v":" "},null,null,null,6,"Ausblenden"]
[null,null,null,null,null,null,104,{"$f":"IF(D121+E121=0,\" \",SUM($H$5+SUM($D$6:$D$52,$D$59:$D$105,$D$112:D121)-SUM($E$6:$E$52,$E$59:$E$105,$E$112:E121)))","v":" "},null,null,null,6,"Ausblenden"]
[null,null,null,null,null,null,105,{"$f":"IF(D122+E122=0,\" \",SUM($H$5+SUM($D$6:$D$52,$D$59:$D$105,$D$112:D122)-SUM($E$6:$E$52,$E$59:$E$105,$E$112:E122)))","v":" "},null,null,null,6,"Ausblenden"]
[null,null,null,null,null,null,106,{"$f":"IF(D123+E123=0,\" \",SUM($H$5+SUM($D$6:$D$52,$D$59:$D$105,$D$112:D123)-SUM($E$6:$E$52,$E$59:$E$105,$E$112:E123)))","v":" "},null,null,null,6,"Ausblenden"]
[null,null,null,null,null,null,107,{"$f":"IF(D124+E124=0,\" \",SUM($H$5+SUM($D$6:$D$52,$D$59:$D$105,$D$112:D124)-SUM($E$6:$E$52,$E$59:$E$105,$E$112:E124)))","v":" "},null,null,null,6,"Ausblenden"]
[null,null,null,null,null,null,108,{"$f":"IF(D125+E125=0,\" \",SUM($H$5+SUM($D$6:$D$52,$D$59:$D$105,$D$112:D125)-SUM($E$6:$E$52,$E$59:$E$105,$E$112:E125)))","v":" "},null,null,null,6,"Ausblenden"]
[null,null,null,null,null,null,109,{"$f":"IF(D126+E126=0,\" \",SUM($H$5+SUM($D$6:$D$52,$D$59:$D$105,$D$112:D126)-SUM($E$6:$E$52,$E$59:$E$105,$E$112:E126)))","v":" "},null,null,null,6,"Ausblenden"]
[null,null,null,null,null,null,110,{"$f":"IF(D127+E127=0,\" \",SUM($H$5+SUM($D$6:$D$52,$D$59:$D$105,$D$112:D127)-SUM($E$6:$E$52,$E$59:$E$105,$E$112:E127)))","v":" "},null,null,null,6,"Ausblenden"]
[null,null,null,null,null,null,111,{"$f":"IF(D128+E128=0,\" \",SUM($H$5+SUM($D$6:$D$52,$D$59:$D$105,$D$112:D128)-SUM($E$6:$E$52,$E$59:$E$105,$E$112:E128)))","v":" "},null,null,null,6,"Ausblenden"]
[null,null,null,null,null,null,112,{"$f":"IF(D129+E129=0,\" \",SUM($H$5+SUM($D$6:$D$52,$D$59:$D$105,$D$112:D129)-SUM($E$6:$E$52,$E$59:$E$105,$E$112:E129)))","v":" "},null,null,null,6,"Ausblenden"]
[null,null,null,null,null,null,113,{"$f":"IF(D130+E130=0,\" \",SUM($H$5+SUM($D$6:$D$52,$D$59:$D$105,$D$112:D130)-SUM($E$6:$E$52,$E$59:$E$105,$E$112:E130)))","v":" "},null,null,null,6,"Ausblenden"]
[null,null,null,null,null,null,114,{"$f":"IF(D131+E131=0,\" \",SUM($H$5+SUM($D$6:$D$52,$D$59:$D$105,$D$112:D131)-SUM($E$6:$E$52,$E$59:$E$105,$E$112:E131)))","v":" "},null,null,null,6,"Ausblenden"]
[null,null,null,null,null,null,115,{"$f":"IF(D132+E132=0,\" \",SUM($H$5+SUM($D$6:$D$52,$D$59:$D$105,$D$112:D132)-SUM($E$6:$E$52,$E$59:$E$105,$E$112:E132)))","v":" "},null,null,null,6,"Ausblenden"]
[null,null,null,null,null,null,116,{"$f":"IF(D133+E133=0,\" \",SUM($H$5+SUM($D$6:$D$52,$D$59:$D$105,$D$112:D133)-SUM($E$6:$E$52,$E$59:$E$105,$E$112:E133)))","v":" "},null,null,null,6,"Ausblenden"]
[null,null,null,null,null,null,117,{"$f":"IF(D134+E134=0,\" \",SUM($H$5+SUM($D$6:$D$52,$D$59:$D$105,$D$112:D134)-SUM($E$6:$E$52,$E$59:$E$105,$E$112:E134)))","v":" "},null,null,null,6,"Ausblenden"]
[null,null,null,null,null,null,118,{"$f":"IF(D135+E135=0,\" \",SUM($H$5+SUM($D$6:$D$52,$D$59:$D$105,$D$112:D135)-SUM($E$6:$E$52,$E$59:$E$105,$E$112:E135)))","v":" "},null,null,null,6,"Ausblenden"]
[null,null,null,null,null,null,119,{"$f":"IF(D136+E136=0,\" \",SUM($H$5+SUM($D$6:$D$52,$D$59:$D$105,$D$112:D136)-SUM($E$6:$E$52,$E$59:$E$105,$E$112:E136)))","v":" "},null,null,null,6,"Ausblenden"]
[null,null,null,null,null,null,120,{"$f":"IF(D137+E137=0,\" \",SUM($H$5+SUM($D$6:$D$52,$D$59:$D$105,$D$112:D137)-SUM($E$6:$E$52,$E$59:$E$105,$E$112:E137)))","v":" "},null,null,null,6,"Ausblenden"]
[null,null,null,null,null,null,121,{"$f":"IF(D138+E138=0,\" \",SUM($H$5+SUM($D$6:$D$52,$D$59:$D$105,$D$112:D138)-SUM($E$6:$E$52,$E$59:$E$105,$E$112:E138)))","v":" "},null,null,null,6,"Ausblenden"]
[null,null,null,null,null,null,122,{"$f":"IF(D139+E139=0,\" \",SUM($H$5+SUM($D$6:$D$52,$D$59:$D$105,$D$112:D139)-SUM($E$6:$E$52,$E$59:$E$105,$E$112:E139)))","v":" "},null,null,null,6,"Ausblenden"]
[null,null,null,null,null,null,123,{"$f":"IF(D140+E140=0,\" \",SUM($H$5+SUM($D$6:$D$52,$D$59:$D$105,$D$112:D140)-SUM($E$6:$E$52,$E$59:$E$105,$E$112:E140)))","v":" "},null,null,null,6,"Ausblenden"]
[null,null,null,null,null,null,124,{"$f":"IF(D141+E141=0,\" \",SUM($H$5+SUM($D$6:$D$52,$D$59:$D$105,$D$112:D141)-SUM($E$6:$E$52,$E$59:$E$105,$E$112:E141)))","v":" "},null,null,null,6,"Ausblenden"]
[null,null,null,null,null,null,125,{"$f":"IF(D142+E142=0,\" \",SUM($H$5+SUM($D$6:$D$52,$D$59:$D$105,$D$112:D142)-SUM($E$6:$E$52,$E$59:$E$105,$E$112:E142)))","v":" "},null,null,null,6,"Ausblenden"]
[null,null,null,null,null,null,126,{"$f":"IF(D143+E143=0,\" \",SUM($H$5+SUM($D$6:$D$52,$D$59:$D$105,$D$112:D143)-SUM($E$6:$E$52,$E$59:$E$105,$E$112:E143)))","v":" "},null,null,null,6,"Ausblenden"]
[null,null,null,null,null,null,127,{"$f":"IF(D144+E144=0,\" \",SUM($H$5+SUM($D$6:$D$52,$D$59:$D$105,$D$112:D144)-SUM($E$6:$E$52,$E$59:$E$105,$E$112:E144)))","v":" "},null,null,null,6,"Ausblenden"]
[null,null,null,null,null,null,128,{"$f":"IF(D145+E145=0,\" \",SUM($H$5+SUM($D$6:$D$52,$D$59:$D$105,$D$112:D145)-SUM($E$6:$E$52,$E$59:$E$105,$E$112:E145)))","v":" "},null,null,null,6,"Ausblenden"]
[null,null,null,null,null,null,129,{"$f":"IF(D146+E146=0,\" \",SUM($H$5+SUM($D$6:$D$52,$D$59:$D$105,$D$112:D146)-SUM($E$6:$E$52,$E$59:$E$105,$E$112:E146)))","v":" "},null,null,null,6,"Ausblenden"]
[null,null,null,null,null,null,130,{"$f":"IF(D147+E147=0,\" \",SUM($H$5+SUM($D$6:$D$52,$D$59:$D$105,$D$112:D147)-SUM($E$6:$E$52,$E$59:$E$105,$E$112:E147)))","v":" "},null,null,null,6,"Ausblenden"]
[null,null,null,null,null,null,131,{"$f":"IF(D148+E148=0,\" \",SUM($H$5+SUM($D$6:$D$52,$D$59:$D$105,$D$112:D148)-SUM($E$6:$E$52,$E$59:$E$105,$E$112:E148)))","v":" "},null,null,null,6,"Ausblenden"]
[null,null,null,null,null,null,132,{"$f":"IF(D149+E149=0,\" \",SUM($H$5+SUM($D$6:$D$52,$D$59:$D$105,$D$112:D149)-SUM($E$6:$E$52,$E$59:$E$105,$E$112:E149)))","v":" "},null,null,null,6,"Ausblenden"]
[null,null,null,null,null,null,133,{"$f":"IF(D150+E150=0,\" \",SUM($H$5+SUM($D$6:$D$52,$D$59:$D$105,$D$112:D150)-SUM($E$6:$E$52,$E$59:$E$105,$E$112:E150)))","v":" "},null,null,null,6,"Ausblenden"]
[null,null,null,null,null,null,134,{"$f":"IF(D151+E151=0,\" \",SUM($H$5+SUM($D$6:$D$52,$D$59:$D$105,$D$112:D151)-SUM($E$6:$E$52,$E$59:$E$105,$E$112:E151)))","v":" "},null,null,null,6,"Ausblenden"]
[null,null,null,null,null,null,135,{"$f":"IF(D152+E152=0,\" \",SUM($H$5+SUM($D$6:$D$52,$D$59:$D$105,$D$112:D152)-SUM($E$6:$E$52,$E$59:$E$105,$E$112:E152)))","v":" "},null,null,null,6,"Ausblenden"]
[null,null,null,null,null,null,136,{"$f":"IF(D153+E153=0,\" \",SUM($H$5+SUM($D$6:$D$52,$D$59:$D$105,$D$112:D153)-SUM($E$6:$E$52,$E$59:$E$105,$E$112:E153)))","v":" "},null,null,null,6,"Ausblenden"]
[null,null,null,null,null,null,137,{"$f":"IF(D154+E154=0,\" \",SUM($H$5+SUM($D$6:$D$52,$D$59:$D$105,$D$112:D154)-SUM($E$6:$E$52,$E$59:$E$105,$E$112:E154)))","v":" "},null,null,null,6,"Ausblenden"]
[null,null,null,null,null,null,138,{"$f":"IF(D155+E155=0,\" \",SUM($H$5+SUM($D$6:$D$52,$D$59:$D$105,$D$112:D155)-SUM($E$6:$E$52,$E$59:$E$105,$E$112:E155)))","v":" "},null,null,null,6,"Ausblenden"]
[null,null,null,null,null,null,139,{"$f":"IF(D156+E156=0,\" \",SUM($H$5+SUM($D$6:$D$52,$D$59:$D$105,$D$112:D156)-SUM($E$6:$E$52,$E$59:$E$105,$E$112:E156)))","v":" "},null,null,null,6,"Ausblenden"]
[null,null,null,null,null,null,140,{"$f":"IF(D157+E157=0,\" \",SUM($H$5+SUM($D$6:$D$52,$D$59:$D$105,$D$112:D157)-SUM($E$6:$E$52,$E$59:$E$105,$E$112:E157)))","v":" "},null,null,null,6,"Ausblenden"]
[null,null,null,null,null,null,141,{"$f":"IF(D158+E158=0,\" \",SUM($H$5+SUM($D$6:$D$52,$D$59:$D$105,$D$112:D158)-SUM($E$6:$E$52,$E$59:$E$105,$E$112:E158)))","v":" "},null,null,null,6,"Ausblenden"]
[null,"Total",null,{"$f":"SUM(D111:D158)","v":0},{"$f":"SUM(E111:E158)","v":0},null,null,{"$f":"$H$5+D159-E159","v":0},null,null,null,null,{"$f":"IF(SUM($L$112:$L$158)<282,\"Einblenden\",\"Ausblenden\")","v":"Ausblenden"}]

{"sheet":"Juni","index":6,"n_rows":159,"n_cols":13,"rows_kept":159,"cut":false,"hidden":false,"merged":[]}
[{"$f":"Mai!A1+31","v":"2023-06-05"}]
[]
["Datum:","Text","FIBU","Einnahmen","Ausgaben",{"$f":"Januar!F3","v":"?"},null,"Saldo"]
[]
[1,"Saldovortrag",null,null,null,null,null,{"$f":"SUM(Mai!H159)","v":0}]
[null,null,null,null,null,null,1,{"$f":"IF(D6+E6=0,\" \",SUM($H$5+SUM($D$6:D6)-SUM($E$6:E6)))","v":" "},null,null,null,null,"Einblenden"]
[null,null,null,null,null,null,2,{"$f":"IF(D7+E7=0,\" \",SUM($H$5+SUM($D$6:D7)-SUM($E$6:E7)))","v":" "},null,null,null,{"$f":"COUNTIF(A7:F7,\"\")","v":6},{"$f":"IF(L7<6,\"Einblenden\",\"Ausblenden\")","v":"Ausblenden"}]
[null,null,null,null,null,null,3,{"$f":"IF(D8+E8=0,\" \",SUM($H$5+SUM($D$6:D8)-SUM($E$6:E8)))","v":" "},null,null,null,{"$f":"COUNTIF(A8:F8,\"\")","v":6},{"$f":"IF(L8<6,\"Einblenden\",\"Ausblenden\")","v":"Ausblenden"}]
[null,null,null,null,null,null,4,{"$f":"IF(D9+E9=0,\" \",SUM($H$5+SUM($D$6:D9)-SUM($E$6:E9)))","v":" "},null,null,null,6,"Ausblenden"]
[null,null,null,null,null,null,5,{"$f":"IF(D10+E10=0,\" \",SUM($H$5+SUM($D$6:D10)-SUM($E$6:E10)))","v":" "},null,null,null,6,"Ausblenden"]
[null,null,null,null,null,null,6,{"$f":"IF(D11+E11=0,\" \",SUM($H$5+SUM($D$6:D11)-SUM($E$6:E11)))","v":" "},null,null,null,6,"Ausblenden"]
[null,null,null,null,null,null,7,{"$f":"IF(D12+E12=0,\" \",SUM($H$5+SUM($D$6:D12)-SUM($E$6:E12)))","v":" "},null,null,null,6,"Ausblenden"]
[null,null,null,null,null,null,8,{"$f":"IF(D13+E13=0,\" \",SUM($H$5+SUM($D$6:D13)-SUM($E$6:E13)))","v":" "},null,null,null,6,"Ausblenden"]
[null,null,null,null,null,null,9,{"$f":"IF(D14+E14=0,\" \",SUM($H$5+SUM($D$6:D14)-SUM($E$6:E14)))","v":" "},null,null,null,6,"Ausblenden"]
[null,null,null,null,null,null,10,{"$f":"IF(D15+E15=0,\" \",SUM($H$5+SUM($D$6:D15)-SUM($E$6:E15)))","v":" "},null,null,null,6,"Ausblenden"]
[null,null,null,null,null,null,11,{"$f":"IF(D16+E16=0,\" \",SUM($H$5+SUM($D$6:D16)-SUM($E$6:E16)))","v":" "},null,null,null,6,"Ausblenden"]
[null,null,null,null,null,null,12,{"$f":"IF(D17+E17=0,\" \",SUM($H$5+SUM($D$6:D17)-SUM($E$6:E17)))","v":" "},null,null,null,6,"Ausblenden"]
[null,null,null,null,null,null,13,{"$f":"IF(D18+E18=0,\" \",SUM($H$5+SUM($D$6:D18)-SUM($E$6:E18)))","v":" "},null,null,null,6,"Ausblenden"]
[null,null,null,null,null,null,14,{"$f":"IF(D19+E19=0,\" \",SUM($H$5+SUM($D$6:D19)-SUM($E$6:E19)))","v":" "},null,null,null,6,"Ausblenden"]
[null,null,null,null,null,null,15,{"$f":"IF(D20+E20=0,\" \",SUM($H$5+SUM($D$6:D20)-SUM($E$6:E20)))","v":" "},null,null,null,6,"Ausblenden"]
[null,null,null,null,null,null,16,{"$f":"IF(D21+E21=0,\" \",SUM($H$5+SUM($D$6:D21)-SUM($E$6:E21)))","v":" "},null,null,null,6,"Ausblenden"]
[null,null,null,null,null,null,17,{"$f":"IF(D22+E22=0,\" \",SUM($H$5+SUM($D$6:D22)-SUM($E$6:E22)))","v":" "},null,null,null,6,"Ausblenden"]
[null,null,null,null,null,null,18,{"$f":"IF(D23+E23=0,\" \",SUM($H$5+SUM($D$6:D23)-SUM($E$6:E23)))","v":" "},null,null,null,6,"Ausblenden"]
[null,null,null,null,null,null,19,{"$f":"IF(D24+E24=0,\" \",SUM($H$5+SUM($D$6:D24)-SUM($E$6:E24)))","v":" "},null,null,null,6,"Ausblenden"]
[null,null,null,null,null,null,20,{"$f":"IF(D25+E25=0,\" \",SUM($H$5+SUM($D$6:D25)-SUM($E$6:E25)))","v":" "},null,null,null,6,"Ausblenden"]
[null,null,null,null,null,null,21,{"$f":"IF(D26+E26=0,\" \",SUM($H$5+SUM($D$6:D26)-SUM($E$6:E26)))","v":" "},null,null,null,6,"Ausblenden"]
[null,null,null,null,null,null,22,{"$f":"IF(D27+E27=0,\" \",SUM($H$5+SUM($D$6:D27)-SUM($E$6:E27)))","v":" "},null,null,null,6,"Ausblenden"]
[null,null,null,null,null,null,23,{"$f":"IF(D28+E28=0,\" \",SUM($H$5+SUM($D$6:D28)-SUM($E$6:E28)))","v":" "},null,null,null,6,"Ausblenden"]
[null,null,null,null,null,null,24,{"$f":"IF(D29+E29=0,\" \",SUM($H$5+SUM($D$6:D29)-SUM($E$6:E29)))","v":" "},null,null,null,6,"Ausblenden"]
[null,null,null,null,null,null,25,{"$f":"IF(D30+E30=0,\" \",SUM($H$5+SUM($D$6:D30)-SUM($E$6:E30)))","v":" "},null,null,null,6,"Ausblenden"]
[null,null,null,null,null,null,26,{"$f":"IF(D31+E31=0,\" \",SUM($H$5+SUM($D$6:D31)-SUM($E$6:E31)))","v":" "},null,null,null,6,"Ausblenden"]
[null,null,null,null,null,null,27,{"$f":"IF(D32+E32=0,\" \",SUM($H$5+SUM($D$6:D32)-SUM($E$6:E32)))","v":" "},null,null,null,6,"Ausblenden"]
[null,null,null,null,null,null,28,{"$f":"IF(D33+E33=0,\" \",SUM($H$5+SUM($D$6:D33)-SUM($E$6:E33)))","v":" "},null,null,null,6,"Ausblenden"]
[null,null,null,null,null,null,29,{"$f":"IF(D34+E34=0,\" \",SUM($H$5+SUM($D$6:D34)-SUM($E$6:E34)))","v":" "},null,null,null,6,"Ausblenden"]
[null,null,null,null,null,null,30,{"$f":"IF(D35+E35=0,\" \",SUM($H$5+SUM($D$6:D35)-SUM($E$6:E35)))","v":" "},null,null,null,6,"Ausblenden"]
[null,null,null,null,null,null,31,{"$f":"IF(D36+E36=0,\" \",SUM($H$5+SUM($D$6:D36)-SUM($E$6:E36)))","v":" "},null,null,null,6,"Ausblenden"]
[null,null,null,null,null,null,32,{"$f":"IF(D37+E37=0,\" \",SUM($H$5+SUM($D$6:D37)-SUM($E$6:E37)))","v":" "},null,null,null,6,"Ausblenden"]
[null,null,null,null,null,null,33,{"$f":"IF(D38+E38=0,\" \",SUM($H$5+SUM($D$6:D38)-SUM($E$6:E38)))","v":" "},null,null,null,6,"Ausblenden"]
[null,null,null,null,null,null,34,{"$f":"IF(D39+E39=0,\" \",SUM($H$5+SUM($D$6:D39)-SUM($E$6:E39)))","v":" "},null,null,null,6,"Ausblenden"]
[null,null,null,null,null,null,35,{"$f":"IF(D40+E40=0,\" \",SUM($H$5+SUM($D$6:D40)-SUM($E$6:E40)))","v":" "},null,null,null,6,"Ausblenden"]
[null,null,null,null,null,null,36,{"$f":"IF(D41+E41=0,\" \",SUM($H$5+SUM($D$6:D41)-SUM($E$6:E41)))","v":" "},null,null,null,6,"Ausblenden"]
[null,null,null,null,null,null,37,{"$f":"IF(D42+E42=0,\" \",SUM($H$5+SUM($D$6:D42)-SUM($E$6:E42)))","v":" "},null,null,null,6,"Ausblenden"]
[null,null,null,null,null,null,38,{"$f":"IF(D43+E43=0,\" \",SUM($H$5+SUM($D$6:D43)-SUM($E$6:E43)))","v":" "},null,null,null,6,"Ausblenden"]
[null,null,null,null,null,null,39,{"$f":"IF(D44+E44=0,\" \",SUM($H$5+SUM($D$6:D44)-SUM($E$6:E44)))","v":" "},null,null,null,6,"Ausblenden"]
[null,null,null,null,null,null,40,{"$f":"IF(D45+E45=0,\" \",SUM($H$5+SUM($D$6:D45)-SUM($E$6:E45)))","v":" "},null,null,null,6,"Ausblenden"]
[null,null,null,null,null,null,41,{"$f":"IF(D46+E46=0,\" \",SUM($H$5+SUM($D$6:D46)-SUM($E$6:E46)))","v":" "},null,null,null,6,"Ausblenden"]
[null,null,null,null,null,null,42,{"$f":"IF(D47+E47=0,\" \",SUM($H$5+SUM($D$6:D47)-SUM($E$6:E47)))","v":" "},null,null,null,6,"Ausblenden"]
[null,null,null,null,null,null,43,{"$f":"IF(D48+E48=0,\" \",SUM($H$5+SUM($D$6:D48)-SUM($E$6:E48)))","v":" "},null,null,null,6,"Ausblenden"]
[null,null,null,null,null,null,44,{"$f":"IF(D49+E49=0,\" \",SUM($H$5+SUM($D$6:D49)-SUM($E$6:E49)))","v":" "},null,null,null,6,"Ausblenden"]
[null,null,null,null,null,null,45,{"$f":"IF(D50+E50=0,\" \",SUM($H$5+SUM($D$6:D50)-SUM($E$6:E50)))","v":" "},null,null,null,6,"Ausblenden"]
[null,null,null,null,null,null,46,{"$f":"IF(D51+E51=0,\" \",SUM($H$5+SUM($D$6:D51)-SUM($E$6:E51)))","v":" "},null,null,null,6,"Ausblenden"]
[null,null,null,null,null,null,47,{"$f":"IF(D52+E52=0,\" \",SUM($H$5+SUM($D$6:D52)-SUM($E$6:E52)))","v":" "},null,null,null,6,"Ausblenden"]
[null,{"$f":"IF(SUM(D59:E105)<>0,\"Uebertrag\",\"Total\")","v":"Total"},null,{"$f":"SUM(D5:D52)","v":0},{"$f":"SUM(E5:E52)","v":0},null,null,{"$f":"H5+D53-E53","v":0},null,null,null,null,"Einblenden"]
[{"$f":"A1","v":"2023-06-05"},null,null,null,null,null,null,"Seite 2",null,null,null,null,{"$f":"IF(SUM($L$59:$L$105)<282,\"Einblenden\",\"Ausblenden\")","v":"Ausblenden"}]
[null,null,null,null,null,null,null,null,null,null,null,null,{"$f":"IF(SUM($L$59:$L$105)<282,\"Einblenden\",\"Ausblenden\")","v":"Ausblenden"}]
["Datum:","Text","FIBU","Einnahmen","Ausgaben",{"$f":"F3","v":"?"},null,"Saldo",null,null,null,null,{"$f":"IF(SUM($L$59:$L$105)<282,\"Einblenden\",\"Ausblenden\")","v":"Ausblenden"}]
[null,null,null,null,null,null,null,null,null,null,null,null,{"$f":"IF(SUM($L$59:$L$105)<282,\"Einblenden\",\"Ausblenden\")","v":"Ausblenden"}]
[null,"Uebertrag",null,{"$f":"D53","v":0},{"$f":"E53","v":0},null,null,{"$f":"H53","v":0},null,null,null,null,{"$f":"IF(SUM($L$59:$L$105)<282,\"Einblenden\",\"Ausblenden\")","v":"Ausblenden"}]
[null,null,null,null,null,null,48,{"$f":"IF(D59+E59=0,\" \",SUM($H$5+SUM($D$6:$D$52,$D$59:D59)-SUM($E$6:$E$52,$E$59:E59)))","v":" "},null,null,null,{"$f":"COUNTIF(A59:F59,\"\")","v":6},{"$f":"IF(L59<6,\"Einblenden\",\"Ausblenden\")","v":"Ausblenden"}]
[null,null,null,null,null,null,49,{"$f":"IF(D60+E60=0,\" \",SUM($H$5+SUM($D$6:$D$52,$D$59:D60)-SUM($E$6:$E$52,$E$59:E60)))","v":" "},null,null,null,{"$f":"COUNTIF(A60:F60,\"\")","v":6},{"$f":"IF(L60<6,\"Einblenden\",\"Ausblenden\")","v":"Ausblenden"}]
[null,null,null,null,null,null,50,{"$f":"IF(D61+E61=0,\" \",SUM($H$5+SUM($D$6:$D$52,$D$59:D61)-SUM($E$6:$E$52,$E$59:E61)))","v":" "},null,null,null,6,"Ausblenden"]
[null,null,null,null,null,null,51,{"$f":"IF(D62+E62=0,\" \",SUM($H$5+SUM($D$6:$D$52,$D$59:D62)-SUM($E$6:$E$52,$E$59:E62)))","v":" "},null,null,null,6,"Ausblenden"]
[null,null,null,null,null,null,52,{"$f":"IF(D63+E63=0,\" \",SUM($H$5+SUM($D$6:$D$52,$D$59:D63)-SUM($E$6:$E$52,$E$59:E63)))","v":" "},null,null,null,6,"Ausblenden"]
[null,null,null,null,null,null,53,{"$f":"IF(D64+E64=0,\" \",SUM($H$5+SUM($D$6:$D$52,$D$59:D64)-SUM($E$6:$E$52,$E$59:E64)))","v":" "},null,null,null,6,"Ausblenden"]
[null,null,null,null,null,null,54,{"$f":"IF(D65+E65=0,\" \",SUM($H$5+SUM($D$6:$D$52,$D$59:D65)-SUM($E$6:$E$52,$E$59:E65)))","v":" "},null,null,null,6,"Ausblenden"]
[null,null,null,null,null,null,55,{"$f":"IF(D66+E66=0,\" \",SUM($H$5+SUM($D$6:$D$52,$D$59:D66)-SUM($E$6:$E$52,$E$59:E66)))","v":" "},null,null,null,6,"Ausblenden"]
[null,null,null,null,null,null,56,{"$f":"IF(D67+E67=0,\" \",SUM($H$5+SUM($D$6:$D$52,$D$59:D67)-SUM($E$6:$E$52,$E$59:E67)))","v":" "},null,null,null,6,"Ausblenden"]
[null,null,null,null,null,null,57,{"$f":"IF(D68+E68=0,\" \",SUM($H$5+SUM($D$6:$D$52,$D$59:D68)-SUM($E$6:$E$52,$E$59:E68)))","v":" "},null,null,null,6,"Ausblenden"]
[null,null,null,null,null,null,58,{"$f":"IF(D69+E69=0,\" \",SUM($H$5+SUM($D$6:$D$52,$D$59:D69)-SUM($E$6:$E$52,$E$59:E69)))","v":" "},null,null,null,6,"Ausblenden"]
[null,null,null,null,null,null,59,{"$f":"IF(D70+E70=0,\" \",SUM($H$5+SUM($D$6:$D$52,$D$59:D70)-SUM($E$6:$E$52,$E$59:E70)))","v":" "},null,null,null,6,"Ausblenden"]
[null,null,null,null,null,null,60,{"$f":"IF(D71+E71=0,\" \",SUM($H$5+SUM($D$6:$D$52,$D$59:D71)-SUM($E$6:$E$52,$E$59:E71)))","v":" "},null,null,null,6,"Ausblenden"]
[null,null,null,null,null,null,61,{"$f":"IF(D72+E72=0,\" \",SUM($H$5+SUM($D$6:$D$52,$D$59:D72)-SUM($E$6:$E$52,$E$59:E72)))","v":" "},null,null,null,6,"Ausblenden"]
[null,null,null,null,null,null,62,{"$f":"IF(D73+E73=0,\" \",SUM($H$5+SUM($D$6:$D$52,$D$59:D73)-SUM($E$6:$E$52,$E$59:E73)))","v":" "},null,null,null,6,"Ausblenden"]
[null,null,null,null,null,null,63,{"$f":"IF(D74+E74=0,\" \",SUM($H$5+SUM($D$6:$D$52,$D$59:D74)-SUM($E$6:$E$52,$E$59:E74)))","v":" "},null,null,null,6,"Ausblenden"]
[null,null,null,null,null,null,64,{"$f":"IF(D75+E75=0,\" \",SUM($H$5+SUM($D$6:$D$52,$D$59:D75)-SUM($E$6:$E$52,$E$59:E75)))","v":" "},null,null,null,6,"Ausblenden"]
[null,null,null,null,null,null,65,{"$f":"IF(D76+E76=0,\" \",SUM($H$5+SUM($D$6:$D$52,$D$59:D76)-SUM($E$6:$E$52,$E$59:E76)))","v":" "},null,null,null,6,"Ausblenden"]
[null,null,null,null,null,null,66,{"$f":"IF(D77+E77=0,\" \",SUM($H$5+SUM($D$6:$D$52,$D$59:D77)-SUM($E$6:$E$52,$E$59:E77)))","v":" "},null,null,null,6,"Ausblenden"]
[null,null,null,null,null,null,67,{"$f":"IF(D78+E78=0,\" \",SUM($H$5+SUM($D$6:$D$52,$D$59:D78)-SUM($E$6:$E$52,$E$59:E78)))","v":" "},null,null,null,6,"Ausblenden"]
[null,null,null,null,null,null,68,{"$f":"IF(D79+E79=0,\" \",SUM($H$5+SUM($D$6:$D$52,$D$59:D79)-SUM($E$6:$E$52,$E$59:E79)))","v":" "},null,null,null,6,"Ausblenden"]
[null,null,null,null,null,null,69,{"$f":"IF(D80+E80=0,\" \",SUM($H$5+SUM($D$6:$D$52,$D$59:D80)-SUM($E$6:$E$52,$E$59:E80)))","v":" "},null,null,null,6,"Ausblenden"]
[null,null,null,null,null,null,70,{"$f":"IF(D81+E81=0,\" \",SUM($H$5+SUM($D$6:$D$52,$D$59:D81)-SUM($E$6:$E$52,$E$59:E81)))","v":" "},null,null,null,6,"Ausblenden"]
[null,null,null,null,null,null,71,{"$f":"IF(D82+E82=0,\" \",SUM($H$5+SUM($D$6:$D$52,$D$59:D82)-SUM($E$6:$E$52,$E$59:E82)))","v":" "},null,null,null,6,"Ausblenden"]
[null,null,null,null,null,null,72,{"$f":"IF(D83+E83=0,\" \",SUM($H$5+SUM($D$6:$D$52,$D$59:D83)-SUM($E$6:$E$52,$E$59:E83)))","v":" "},null,null,null,6,"Ausblenden"]
[null,null,null,null,null,null,73,{"$f":"IF(D84+E84=0,\" \",SUM($H$5+SUM($D$6:$D$52,$D$59:D84)-SUM($E$6:$E$52,$E$59:E84)))","v":" "},null,null,null,6,"Ausblenden"]
[null,null,null,null,null,null,74,{"$f":"IF(D85+E85=0,\" \",SUM($H$5+SUM($D$6:$D$52,$D$59:D85)-SUM($E$6:$E$52,$E$59:E85)))","v":" "},null,null,null,6,"Ausblenden"]
[null,null,null,null,null,null,75,{"$f":"IF(D86+E86=0,\" \",SUM($H$5+SUM($D$6:$D$52,$D$59:D86)-SUM($E$6:$E$52,$E$59:E86)))","v":" "},null,null,null,6,"Ausblenden"]
[null,null,null,null,null,null,76,{"$f":"IF(D87+E87=0,\" \",SUM($H$5+SUM($D$6:$D$52,$D$59:D87)-SUM($E$6:$E$52,$E$59:E87)))","v":" "},null,null,null,6,"Ausblenden"]
[null,null,null,null,null,null,77,{"$f":"IF(D88+E88=0,\" \",SUM($H$5+SUM($D$6:$D$52,$D$59:D88)-SUM($E$6:$E$52,$E$59:E88)))","v":" "},null,null,null,6,"Ausblenden"]
[null,null,null,null,null,null,78,{"$f":"IF(D89+E89=0,\" \",SUM($H$5+SUM($D$6:$D$52,$D$59:D89)-SUM($E$6:$E$52,$E$59:E89)))","v":" "},null,null,null,6,"Ausblenden"]
[null,null,null,null,null,null,79,{"$f":"IF(D90+E90=0,\" \",SUM($H$5+SUM($D$6:$D$52,$D$59:D90)-SUM($E$6:$E$52,$E$59:E90)))","v":" "},null,null,null,6,"Ausblenden"]
[null,null,null,null,null,null,80,{"$f":"IF(D91+E91=0,\" \",SUM($H$5+SUM($D$6:$D$52,$D$59:D91)-SUM($E$6:$E$52,$E$59:E91)))","v":" "},null,null,null,6,"Ausblenden"]
[null,null,null,null,null,null,81,{"$f":"IF(D92+E92=0,\" \",SUM($H$5+SUM($D$6:$D$52,$D$59:D92)-SUM($E$6:$E$52,$E$59:E92)))","v":" "},null,null,null,6,"Ausblenden"]
[null,null,null,null,null,null,82,{"$f":"IF(D93+E93=0,\" \",SUM($H$5+SUM($D$6:$D$52,$D$59:D93)-SUM($E$6:$E$52,$E$59:E93)))","v":" "},null,null,null,6,"Ausblenden"]
[null,null,null,null,null,null,83,{"$f":"IF(D94+E94=0,\" \",SUM($H$5+SUM($D$6:$D$52,$D$59:D94)-SUM($E$6:$E$52,$E$59:E94)))","v":" "},null,null,null,6,"Ausblenden"]
[null,null,null,null,null,null,84,{"$f":"IF(D95+E95=0,\" \",SUM($H$5+SUM($D$6:$D$52,$D$59:D95)-SUM($E$6:$E$52,$E$59:E95)))","v":" "},null,null,null,6,"Ausblenden"]
[null,null,null,null,null,null,85,{"$f":"IF(D96+E96=0,\" \",SUM($H$5+SUM($D$6:$D$52,$D$59:D96)-SUM($E$6:$E$52,$E$59:E96)))","v":" "},null,null,null,6,"Ausblenden"]
[null,null,null,null,null,null,86,{"$f":"IF(D97+E97=0,\" \",SUM($H$5+SUM($D$6:$D$52,$D$59:D97)-SUM($E$6:$E$52,$E$59:E97)))","v":" "},null,null,null,6,"Ausblenden"]
[null,null,null,null,null,null,87,{"$f":"IF(D98+E98=0,\" \",SUM($H$5+SUM($D$6:$D$52,$D$59:D98)-SUM($E$6:$E$52,$E$59:E98)))","v":" "},null,null,null,6,"Ausblenden"]
[null,null,null,null,null,null,88,{"$f":"IF(D99+E99=0,\" \",SUM($H$5+SUM($D$6:$D$52,$D$59:D99)-SUM($E$6:$E$52,$E$59:E99)))","v":" "},null,null,null,6,"Ausblenden"]
[null,null,null,null,null,null,89,{"$f":"IF(D100+E100=0,\" \",SUM($H$5+SUM($D$6:$D$52,$D$59:D100)-SUM($E$6:$E$52,$E$59:E100)))","v":" "},null,null,null,6,"Ausblenden"]
[null,null,null,null,null,null,90,{"$f":"IF(D101+E101=0,\" \",SUM($H$5+SUM($D$6:$D$52,$D$59:D101)-SUM($E$6:$E$52,$E$59:E101)))","v":" "},null,null,null,6,"Ausblenden"]
[null,null,null,null,null,null,91,{"$f":"IF(D102+E102=0,\" \",SUM($H$5+SUM($D$6:$D$52,$D$59:D102)-SUM($E$6:$E$52,$E$59:E102)))","v":" "},null,null,null,6,"Ausblenden"]
[null,null,null,null,null,null,92,{"$f":"IF(D103+E103=0,\" \",SUM($H$5+SUM($D$6:$D$52,$D$59:D103)-SUM($E$6:$E$52,$E$59:E103)))","v":" "},null,null,null,6,"Ausblenden"]
[null,null,null,null,null,null,93,{"$f":"IF(D104+E104=0,\" \",SUM($H$5+SUM($D$6:$D$52,$D$59:D104)-SUM($E$6:$E$52,$E$59:E104)))","v":" "},null,null,null,6,"Ausblenden"]
[null,null,null,null,null,null,94,{"$f":"IF(D105+E105=0,\" \",SUM($H$5+SUM($D$6:$D$52,$D$59:D105)-SUM($E$6:$E$52,$E$59:E105)))","v":" "},null,null,null,{"$f":"COUNTIF(A105:F105,\"\")","v":6},"Ausblenden"]
[null,{"$f":"IF(SUM(D112:E158)<>0,\"Uebertrag\",\"Total\")","v":"Total"},null,{"$f":"SUM(D58:D105)","v":0},{"$f":"SUM(E58:E105)","v":0},null,null,{"$f":"$H$5+D106-E106","v":0},null,null,null,null,{"$f":"IF(SUM($L$59:$L$105)<282,\"Einblenden\",\"Ausblenden\")","v":"Ausblenden"}]
[{"$f":"A1","v":"2023-06-05"},null,null,null,null,null,null,"Seite 3",null,null,null,null,{"$f":"IF(SUM($L$112:$L$158)<282,\"Einblenden\",\"Ausblenden\")","v":"Ausblenden"}]
[null,null,null,null,null,null,null,null,null,null,null,null,{"$f":"IF(SUM($L$112:$L$158)<282,\"Einblenden\",\"Ausblenden\")","v":"Ausblenden"}]
["Datum:","Text","FIBU","Einnahmen","Ausgaben",{"$f":"F3","v":"?"},null,"Saldo",null,null,null,null,{"$f":"IF(SUM($L$112:$L$158)<282,\"Einblenden\",\"Ausblenden\")","v":"Ausblenden"}]
[null,null,null,null,null,null,null,null,null,null,null,null,{"$f":"IF(SUM($L$112:$L$158)<282,\"Einblenden\",\"Ausblenden\")","v":"Ausblenden"}]
[null,"Uebertrag",null,{"$f":"D106","v":0},{"$f":"E106","v":0},null,null,{"$f":"H106","v":0},null,null,null,null,{"$f":"IF(SUM($L$112:$L$158)<282,\"Einblenden\",\"Ausblenden\")","v":"Ausblenden"}]
[null,null,null,null,null,null,95,{"$f":"IF(D112+E112=0,\" \",SUM($H$5+SUM($D$6:$D$52,$D$59:$D$105,$D$112:D112)-SUM($E$6:$E$52,$E$59:$E$105,$E$112:E112)))","v":" "},null,null,null,{"$f":"COUNTIF(A112:F112,\"\")","v":6},{"$f":"IF(L112<6,\"Einblenden\",\"Ausblenden\")","v":"Ausblenden"}]
[null,null,null,null,null,null,96,{"$f":"IF(D113+E113=0,\" \",SUM($H$5+SUM($D$6:$D$52,$D$59:$D$105,$D$112:D113)-SUM($E$6:$E$52,$E$59:$E$105,$E$112:E113)))","v":" "},null,null,null,{"$f":"COUNTIF(A113:F113,\"\")","v":6},"Ausblenden"]
[null,null,null,null,null,null,97,{"$f":"IF(D114+E114=0,\" \",SUM($H$5+SUM($D$6:$D$52,$D$59:$D$105,$D$112:D114)-SUM($E$6:$E$52,$E$59:$E$105,$E$112:E114)))","v":" "},null,null,null,6,"Ausblenden"]
[null,null,null,null,null,null,98,{"$f":"IF(D115+E115=0,\" \",SUM($H$5+SUM($D$6:$D$52,$D$59:$D$105,$D$112:D115)-SUM($E$6:$E$52,$E$59:$E$105,$E$112:E115)))","v":" "},null,null,null,6,"Ausblenden"]
[null,null,null,null,null,null,99,{"$f":"IF(D116+E116=0,\" \",SUM($H$5+SUM($D$6:$D$52,$D$59:$D$105,$D$112:D116)-SUM($E$6:$E$52,$E$59:$E$105,$E$112:E116)))","v":" "},null,null,null,6,"Ausblenden"]
[null,null,null,null,null,null,100,{"$f":"IF(D117+E117=0,\" \",SUM($H$5+SUM($D$6:$D$52,$D$59:$D$105,$D$112:D117)-SUM($E$6:$E$52,$E$59:$E$105,$E$112:E117)))","v":" "},null,null,null,6,"Ausblenden"]
[null,null,null,null,null,null,101,{"$f":"IF(D118+E118=0,\" \",SUM($H$5+SUM($D$6:$D$52,$D$59:$D$105,$D$112:D118)-SUM($E$6:$E$52,$E$59:$E$105,$E$112:E118)))","v":" "},null,null,null,6,"Ausblenden"]
[null,null,null,null,null,null,102,{"$f":"IF(D119+E119=0,\" \",SUM($H$5+SUM($D$6:$D$52,$D$59:$D$105,$D$112:D119)-SUM($E$6:$E$52,$E$59:$E$105,$E$112:E119)))","v":" "},null,null,null,6,"Ausblenden"]
[null,null,null,null,null,null,103,{"$f":"IF(D120+E120=0,\" \",SUM($H$5+SUM($D$6:$D$52,$D$59:$D$105,$D$112:D120)-SUM($E$6:$E$52,$E$59:$E$105,$E$112:E120)))","v":" "},null,null,null,6,"Ausblenden"]
[null,null,null,null,null,null,104,{"$f":"IF(D121+E121=0,\" \",SUM($H$5+SUM($D$6:$D$52,$D$59:$D$105,$D$112:D121)-SUM($E$6:$E$52,$E$59:$E$105,$E$112:E121)))","v":" "},null,null,null,6,"Ausblenden"]
[null,null,null,null,null,null,105,{"$f":"IF(D122+E122=0,\" \",SUM($H$5+SUM($D$6:$D$52,$D$59:$D$105,$D$112:D122)-SUM($E$6:$E$52,$E$59:$E$105,$E$112:E122)))","v":" "},null,null,null,6,"Ausblenden"]
[null,null,null,null,null,null,106,{"$f":"IF(D123+E123=0,\" \",SUM($H$5+SUM($D$6:$D$52,$D$59:$D$105,$D$112:D123)-SUM($E$6:$E$52,$E$59:$E$105,$E$112:E123)))","v":" "},null,null,null,6,"Ausblenden"]
[null,null,null,null,null,null,107,{"$f":"IF(D124+E124=0,\" \",SUM($H$5+SUM($D$6:$D$52,$D$59:$D$105,$D$112:D124)-SUM($E$6:$E$52,$E$59:$E$105,$E$112:E124)))","v":" "},null,null,null,6,"Ausblenden"]
[null,null,null,null,null,null,108,{"$f":"IF(D125+E125=0,\" \",SUM($H$5+SUM($D$6:$D$52,$D$59:$D$105,$D$112:D125)-SUM($E$6:$E$52,$E$59:$E$105,$E$112:E125)))","v":" "},null,null,null,6,"Ausblenden"]
[null,null,null,null,null,null,109,{"$f":"IF(D126+E126=0,\" \",SUM($H$5+SUM($D$6:$D$52,$D$59:$D$105,$D$112:D126)-SUM($E$6:$E$52,$E$59:$E$105,$E$112:E126)))","v":" "},null,null,null,6,"Ausblenden"]
[null,null,null,null,null,null,110,{"$f":"IF(D127+E127=0,\" \",SUM($H$5+SUM($D$6:$D$52,$D$59:$D$105,$D$112:D127)-SUM($E$6:$E$52,$E$59:$E$105,$E$112:E127)))","v":" "},null,null,null,6,"Ausblenden"]
[null,null,null,null,null,null,111,{"$f":"IF(D128+E128=0,\" \",SUM($H$5+SUM($D$6:$D$52,$D$59:$D$105,$D$112:D128)-SUM($E$6:$E$52,$E$59:$E$105,$E$112:E128)))","v":" "},null,null,null,6,"Ausblenden"]
[null,null,null,null,null,null,112,{"$f":"IF(D129+E129=0,\" \",SUM($H$5+SUM($D$6:$D$52,$D$59:$D$105,$D$112:D129)-SUM($E$6:$E$52,$E$59:$E$105,$E$112:E129)))","v":" "},null,null,null,6,"Ausblenden"]
[null,null,null,null,null,null,113,{"$f":"IF(D130+E130=0,\" \",SUM($H$5+SUM($D$6:$D$52,$D$59:$D$105,$D$112:D130)-SUM($E$6:$E$52,$E$59:$E$105,$E$112:E130)))","v":" "},null,null,null,6,"Ausblenden"]
[null,null,null,null,null,null,114,{"$f":"IF(D131+E131=0,\" \",SUM($H$5+SUM($D$6:$D$52,$D$59:$D$105,$D$112:D131)-SUM($E$6:$E$52,$E$59:$E$105,$E$112:E131)))","v":" "},null,null,null,6,"Ausblenden"]
[null,null,null,null,null,null,115,{"$f":"IF(D132+E132=0,\" \",SUM($H$5+SUM($D$6:$D$52,$D$59:$D$105,$D$112:D132)-SUM($E$6:$E$52,$E$59:$E$105,$E$112:E132)))","v":" "},null,null,null,6,"Ausblenden"]
[null,null,null,null,null,null,116,{"$f":"IF(D133+E133=0,\" \",SUM($H$5+SUM($D$6:$D$52,$D$59:$D$105,$D$112:D133)-SUM($E$6:$E$52,$E$59:$E$105,$E$112:E133)))","v":" "},null,null,null,6,"Ausblenden"]
[null,null,null,null,null,null,117,{"$f":"IF(D134+E134=0,\" \",SUM($H$5+SUM($D$6:$D$52,$D$59:$D$105,$D$112:D134)-SUM($E$6:$E$52,$E$59:$E$105,$E$112:E134)))","v":" "},null,null,null,6,"Ausblenden"]
[null,null,null,null,null,null,118,{"$f":"IF(D135+E135=0,\" \",SUM($H$5+SUM($D$6:$D$52,$D$59:$D$105,$D$112:D135)-SUM($E$6:$E$52,$E$59:$E$105,$E$112:E135)))","v":" "},null,null,null,6,"Ausblenden"]
[null,null,null,null,null,null,119,{"$f":"IF(D136+E136=0,\" \",SUM($H$5+SUM($D$6:$D$52,$D$59:$D$105,$D$112:D136)-SUM($E$6:$E$52,$E$59:$E$105,$E$112:E136)))","v":" "},null,null,null,6,"Ausblenden"]
[null,null,null,null,null,null,120,{"$f":"IF(D137+E137=0,\" \",SUM($H$5+SUM($D$6:$D$52,$D$59:$D$105,$D$112:D137)-SUM($E$6:$E$52,$E$59:$E$105,$E$112:E137)))","v":" "},null,null,null,6,"Ausblenden"]
[null,null,null,null,null,null,121,{"$f":"IF(D138+E138=0,\" \",SUM($H$5+SUM($D$6:$D$52,$D$59:$D$105,$D$112:D138)-SUM($E$6:$E$52,$E$59:$E$105,$E$112:E138)))","v":" "},null,null,null,6,"Ausblenden"]
[null,null,null,null,null,null,122,{"$f":"IF(D139+E139=0,\" \",SUM($H$5+SUM($D$6:$D$52,$D$59:$D$105,$D$112:D139)-SUM($E$6:$E$52,$E$59:$E$105,$E$112:E139)))","v":" "},null,null,null,6,"Ausblenden"]
[null,null,null,null,null,null,123,{"$f":"IF(D140+E140=0,\" \",SUM($H$5+SUM($D$6:$D$52,$D$59:$D$105,$D$112:D140)-SUM($E$6:$E$52,$E$59:$E$105,$E$112:E140)))","v":" "},null,null,null,6,"Ausblenden"]
[null,null,null,null,null,null,124,{"$f":"IF(D141+E141=0,\" \",SUM($H$5+SUM($D$6:$D$52,$D$59:$D$105,$D$112:D141)-SUM($E$6:$E$52,$E$59:$E$105,$E$112:E141)))","v":" "},null,null,null,6,"Ausblenden"]
[null,null,null,null,null,null,125,{"$f":"IF(D142+E142=0,\" \",SUM($H$5+SUM($D$6:$D$52,$D$59:$D$105,$D$112:D142)-SUM($E$6:$E$52,$E$59:$E$105,$E$112:E142)))","v":" "},null,null,null,6,"Ausblenden"]
[null,null,null,null,null,null,126,{"$f":"IF(D143+E143=0,\" \",SUM($H$5+SUM($D$6:$D$52,$D$59:$D$105,$D$112:D143)-SUM($E$6:$E$52,$E$59:$E$105,$E$112:E143)))","v":" "},null,null,null,6,"Ausblenden"]
[null,null,null,null,null,null,127,{"$f":"IF(D144+E144=0,\" \",SUM($H$5+SUM($D$6:$D$52,$D$59:$D$105,$D$112:D144)-SUM($E$6:$E$52,$E$59:$E$105,$E$112:E144)))","v":" "},null,null,null,6,"Ausblenden"]
[null,null,null,null,null,null,128,{"$f":"IF(D145+E145=0,\" \",SUM($H$5+SUM($D$6:$D$52,$D$59:$D$105,$D$112:D145)-SUM($E$6:$E$52,$E$59:$E$105,$E$112:E145)))","v":" "},null,null,null,6,"Ausblenden"]
[null,null,null,null,null,null,129,{"$f":"IF(D146+E146=0,\" \",SUM($H$5+SUM($D$6:$D$52,$D$59:$D$105,$D$112:D146)-SUM($E$6:$E$52,$E$59:$E$105,$E$112:E146)))","v":" "},null,null,null,6,"Ausblenden"]
[null,null,null,null,null,null,130,{"$f":"IF(D147+E147=0,\" \",SUM($H$5+SUM($D$6:$D$52,$D$59:$D$105,$D$112:D147)-SUM($E$6:$E$52,$E$59:$E$105,$E$112:E147)))","v":" "},null,null,null,6,"Ausblenden"]
[null,null,null,null,null,null,131,{"$f":"IF(D148+E148=0,\" \",SUM($H$5+SUM($D$6:$D$52,$D$59:$D$105,$D$112:D148)-SUM($E$6:$E$52,$E$59:$E$105,$E$112:E148)))","v":" "},null,null,null,6,"Ausblenden"]
[null,null,null,null,null,null,132,{"$f":"IF(D149+E149=0,\" \",SUM($H$5+SUM($D$6:$D$52,$D$59:$D$105,$D$112:D149)-SUM($E$6:$E$52,$E$59:$E$105,$E$112:E149)))","v":" "},null,null,null,6,"Ausblenden"]
[null,null,null,null,null,null,133,{"$f":"IF(D150+E150=0,\" \",SUM($H$5+SUM($D$6:$D$52,$D$59:$D$105,$D$112:D150)-SUM($E$6:$E$52,$E$59:$E$105,$E$112:E150)))","v":" "},null,null,null,6,"Ausblenden"]
[null,null,null,null,null,null,134,{"$f":"IF(D151+E151=0,\" \",SUM($H$5+SUM($D$6:$D$52,$D$59:$D$105,$D$112:D151)-SUM($E$6:$E$52,$E$59:$E$105,$E$112:E151)))","v":" "},null,null,null,6,"Ausblenden"]
[null,null,null,null,null,null,135,{"$f":"IF(D152+E152=0,\" \",SUM($H$5+SUM($D$6:$D$52,$D$59:$D$105,$D$112:D152)-SUM($E$6:$E$52,$E$59:$E$105,$E$112:E152)))","v":" "},null,null,null,6,"Ausblenden"]
[null,null,null,null,null,null,136,{"$f":"IF(D153+E153=0,\" \",SUM($H$5+SUM($D$6:$D$52,$D$59:$D$105,$D$112:D153)-SUM($E$6:$E$52,$E$59:$E$105,$E$112:E153)))","v":" "},null,null,null,6,"Ausblenden"]
[null,null,null,null,null,null,137,{"$f":"IF(D154+E154=0,\" \",SUM($H$5+SUM($D$6:$D$52,$D$59:$D$105,$D$112:D154)-SUM($E$6:$E$52,$E$59:$E$105,$E$112:E154)))","v":" "},null,null,null,6,"Ausblenden"]
[null,null,null,null,null,null,138,{"$f":"IF(D155+E155=0,\" \",SUM($H$5+SUM($D$6:$D$52,$D$59:$D$105,$D$112:D155)-SUM($E$6:$E$52,$E$59:$E$105,$E$112:E155)))","v":" "},null,null,null,6,"Ausblenden"]
[null,null,null,null,null,null,139,{"$f":"IF(D156+E156=0,\" \",SUM($H$5+SUM($D$6:$D$52,$D$59:$D$105,$D$112:D156)-SUM($E$6:$E$52,$E$59:$E$105,$E$112:E156)))","v":" "},null,null,null,6,"Ausblenden"]
[null,null,null,null,null,null,140,{"$f":"IF(D157+E157=0,\" \",SUM($H$5+SUM($D$6:$D$52,$D$59:$D$105,$D$112:D157)-SUM($E$6:$E$52,$E$59:$E$105,$E$112:E157)))","v":" "},null,null,null,6,"Ausblenden"]
[null,null,null,null,null,null,141,{"$f":"IF(D158+E158=0,\" \",SUM($H$5+SUM($D$6:$D$52,$D$59:$D$105,$D$112:D158)-SUM($E$6:$E$52,$E$59:$E$105,$E$112:E158)))","v":" "},null,null,null,6,"Ausblenden"]
[null,"Total",null,{"$f":"SUM(D111:D158)","v":0},{"$f":"SUM(E111:E158)","v":0},null,null,{"$f":"$H$5+D159-E159","v":0},null,null,null,null,{"$f":"IF(SUM($L$112:$L$158)<282,\"Einblenden\",\"Ausblenden\")","v":"Ausblenden"}]

{"sheet":"Juli","index":7,"n_rows":159,"n_cols":13,"rows_kept":159,"cut":false,"hidden":false,"merged":[]}
[{"$f":"Juni!A1+31","v":"2023-07-06"}]
[]
["Datum:","Text","FIBU","Einnahmen","Ausgaben",{"$f":"Januar!F3","v":"?"},null,"Saldo"]
[]
[1,"Saldovortrag",null,null,null,null,null,{"$f":"SUM(Juni!H159)","v":0}]
[null,null,null,null,null,null,1,{"$f":"IF(D6+E6=0,\" \",SUM($H$5+SUM($D$6:D6)-SUM($E$6:E6)))","v":" "},null,null,null,null,"Einblenden"]
[null,null,null,null,null,null,2,{"$f":"IF(D7+E7=0,\" \",SUM($H$5+SUM($D$6:D7)-SUM($E$6:E7)))","v":" "},null,null,null,{"$f":"COUNTIF(A7:F7,\"\")","v":6},{"$f":"IF(L7<6,\"Einblenden\",\"Ausblenden\")","v":"Ausblenden"}]
[null,null,null,null,null,null,3,{"$f":"IF(D8+E8=0,\" \",SUM($H$5+SUM($D$6:D8)-SUM($E$6:E8)))","v":" "},null,null,null,{"$f":"COUNTIF(A8:F8,\"\")","v":6},{"$f":"IF(L8<6,\"Einblenden\",\"Ausblenden\")","v":"Ausblenden"}]
[null,null,null,null,null,null,4,{"$f":"IF(D9+E9=0,\" \",SUM($H$5+SUM($D$6:D9)-SUM($E$6:E9)))","v":" "},null,null,null,6,"Ausblenden"]
[null,null,null,null,null,null,5,{"$f":"IF(D10+E10=0,\" \",SUM($H$5+SUM($D$6:D10)-SUM($E$6:E10)))","v":" "},null,null,null,6,"Ausblenden"]
[null,null,null,null,null,null,6,{"$f":"IF(D11+E11=0,\" \",SUM($H$5+SUM($D$6:D11)-SUM($E$6:E11)))","v":" "},null,null,null,6,"Ausblenden"]
[null,null,null,null,null,null,7,{"$f":"IF(D12+E12=0,\" \",SUM($H$5+SUM($D$6:D12)-SUM($E$6:E12)))","v":" "},null,null,null,6,"Ausblenden"]
[null,null,null,null,null,null,8,{"$f":"IF(D13+E13=0,\" \",SUM($H$5+SUM($D$6:D13)-SUM($E$6:E13)))","v":" "},null,null,null,6,"Ausblenden"]
[null,null,null,null,null,null,9,{"$f":"IF(D14+E14=0,\" \",SUM($H$5+SUM($D$6:D14)-SUM($E$6:E14)))","v":" "},null,null,null,6,"Ausblenden"]
[null,null,null,null,null,null,10,{"$f":"IF(D15+E15=0,\" \",SUM($H$5+SUM($D$6:D15)-SUM($E$6:E15)))","v":" "},null,null,null,6,"Ausblenden"]
[null,null,null,null,null,null,11,{"$f":"IF(D16+E16=0,\" \",SUM($H$5+SUM($D$6:D16)-SUM($E$6:E16)))","v":" "},null,null,null,6,"Ausblenden"]
[null,null,null,null,null,null,12,{"$f":"IF(D17+E17=0,\" \",SUM($H$5+SUM($D$6:D17)-SUM($E$6:E17)))","v":" "},null,null,null,6,"Ausblenden"]
[null,null,null,null,null,null,13,{"$f":"IF(D18+E18=0,\" \",SUM($H$5+SUM($D$6:D18)-SUM($E$6:E18)))","v":" "},null,null,null,6,"Ausblenden"]
[null,null,null,null,null,null,14,{"$f":"IF(D19+E19=0,\" \",SUM($H$5+SUM($D$6:D19)-SUM($E$6:E19)))","v":" "},null,null,null,6,"Ausblenden"]
[null,null,null,null,null,null,15,{"$f":"IF(D20+E20=0,\" \",SUM($H$5+SUM($D$6:D20)-SUM($E$6:E20)))","v":" "},null,null,null,6,"Ausblenden"]
[null,null,null,null,null,null,16,{"$f":"IF(D21+E21=0,\" \",SUM($H$5+SUM($D$6:D21)-SUM($E$6:E21)))","v":" "},null,null,null,6,"Ausblenden"]
[null,null,null,null,null,null,17,{"$f":"IF(D22+E22=0,\" \",SUM($H$5+SUM($D$6:D22)-SUM($E$6:E22)))","v":" "},null,null,null,6,"Ausblenden"]
[null,null,null,null,null,null,18,{"$f":"IF(D23+E23=0,\" \",SUM($H$5+SUM($D$6:D23)-SUM($E$6:E23)))","v":" "},null,null,null,6,"Ausblenden"]
[null,null,null,null,null,null,19,{"$f":"IF(D24+E24=0,\" \",SUM($H$5+SUM($D$6:D24)-SUM($E$6:E24)))","v":" "},null,null,null,6,"Ausblenden"]
[null,null,null,null,null,null,20,{"$f":"IF(D25+E25=0,\" \",SUM($H$5+SUM($D$6:D25)-SUM($E$6:E25)))","v":" "},null,null,null,6,"Ausblenden"]
[null,null,null,null,null,null,21,{"$f":"IF(D26+E26=0,\" \",SUM($H$5+SUM($D$6:D26)-SUM($E$6:E26)))","v":" "},null,null,null,6,"Ausblenden"]
[null,null,null,null,null,null,22,{"$f":"IF(D27+E27=0,\" \",SUM($H$5+SUM($D$6:D27)-SUM($E$6:E27)))","v":" "},null,null,null,6,"Ausblenden"]
[null,null,null,null,null,null,23,{"$f":"IF(D28+E28=0,\" \",SUM($H$5+SUM($D$6:D28)-SUM($E$6:E28)))","v":" "},null,null,null,6,"Ausblenden"]
[null,null,null,null,null,null,24,{"$f":"IF(D29+E29=0,\" \",SUM($H$5+SUM($D$6:D29)-SUM($E$6:E29)))","v":" "},null,null,null,6,"Ausblenden"]
[null,null,null,null,null,null,25,{"$f":"IF(D30+E30=0,\" \",SUM($H$5+SUM($D$6:D30)-SUM($E$6:E30)))","v":" "},null,null,null,6,"Ausblenden"]
[null,null,null,null,null,null,26,{"$f":"IF(D31+E31=0,\" \",SUM($H$5+SUM($D$6:D31)-SUM($E$6:E31)))","v":" "},null,null,null,6,"Ausblenden"]
[null,null,null,null,null,null,27,{"$f":"IF(D32+E32=0,\" \",SUM($H$5+SUM($D$6:D32)-SUM($E$6:E32)))","v":" "},null,null,null,6,"Ausblenden"]
[null,null,null,null,null,null,28,{"$f":"IF(D33+E33=0,\" \",SUM($H$5+SUM($D$6:D33)-SUM($E$6:E33)))","v":" "},null,null,null,6,"Ausblenden"]
[null,null,null,null,null,null,29,{"$f":"IF(D34+E34=0,\" \",SUM($H$5+SUM($D$6:D34)-SUM($E$6:E34)))","v":" "},null,null,null,6,"Ausblenden"]
[null,null,null,null,null,null,30,{"$f":"IF(D35+E35=0,\" \",SUM($H$5+SUM($D$6:D35)-SUM($E$6:E35)))","v":" "},null,null,null,6,"Ausblenden"]
[null,null,null,null,null,null,31,{"$f":"IF(D36+E36=0,\" \",SUM($H$5+SUM($D$6:D36)-SUM($E$6:E36)))","v":" "},null,null,null,6,"Ausblenden"]
[null,null,null,null,null,null,32,{"$f":"IF(D37+E37=0,\" \",SUM($H$5+SUM($D$6:D37)-SUM($E$6:E37)))","v":" "},null,null,null,6,"Ausblenden"]
[null,null,null,null,null,null,33,{"$f":"IF(D38+E38=0,\" \",SUM($H$5+SUM($D$6:D38)-SUM($E$6:E38)))","v":" "},null,null,null,6,"Ausblenden"]
[null,null,null,null,null,null,34,{"$f":"IF(D39+E39=0,\" \",SUM($H$5+SUM($D$6:D39)-SUM($E$6:E39)))","v":" "},null,null,null,6,"Ausblenden"]
[null,null,null,null,null,null,35,{"$f":"IF(D40+E40=0,\" \",SUM($H$5+SUM($D$6:D40)-SUM($E$6:E40)))","v":" "},null,null,null,6,"Ausblenden"]
[null,null,null,null,null,null,36,{"$f":"IF(D41+E41=0,\" \",SUM($H$5+SUM($D$6:D41)-SUM($E$6:E41)))","v":" "},null,null,null,6,"Ausblenden"]
[null,null,null,null,null,null,37,{"$f":"IF(D42+E42=0,\" \",SUM($H$5+SUM($D$6:D42)-SUM($E$6:E42)))","v":" "},null,null,null,6,"Ausblenden"]
[null,null,null,null,null,null,38,{"$f":"IF(D43+E43=0,\" \",SUM($H$5+SUM($D$6:D43)-SUM($E$6:E43)))","v":" "},null,null,null,6,"Ausblenden"]
[null,null,null,null,null,null,39,{"$f":"IF(D44+E44=0,\" \",SUM($H$5+SUM($D$6:D44)-SUM($E$6:E44)))","v":" "},null,null,null,6,"Ausblenden"]
[null,null,null,null,null,null,40,{"$f":"IF(D45+E45=0,\" \",SUM($H$5+SUM($D$6:D45)-SUM($E$6:E45)))","v":" "},null,null,null,6,"Ausblenden"]
[null,null,null,null,null,null,41,{"$f":"IF(D46+E46=0,\" \",SUM($H$5+SUM($D$6:D46)-SUM($E$6:E46)))","v":" "},null,null,null,6,"Ausblenden"]
[null,null,null,null,null,null,42,{"$f":"IF(D47+E47=0,\" \",SUM($H$5+SUM($D$6:D47)-SUM($E$6:E47)))","v":" "},null,null,null,6,"Ausblenden"]
[null,null,null,null,null,null,43,{"$f":"IF(D48+E48=0,\" \",SUM($H$5+SUM($D$6:D48)-SUM($E$6:E48)))","v":" "},null,null,null,6,"Ausblenden"]
[null,null,null,null,null,null,44,{"$f":"IF(D49+E49=0,\" \",SUM($H$5+SUM($D$6:D49)-SUM($E$6:E49)))","v":" "},null,null,null,6,"Ausblenden"]
[null,null,null,null,null,null,45,{"$f":"IF(D50+E50=0,\" \",SUM($H$5+SUM($D$6:D50)-SUM($E$6:E50)))","v":" "},null,null,null,6,"Ausblenden"]
[null,null,null,null,null,null,46,{"$f":"IF(D51+E51=0,\" \",SUM($H$5+SUM($D$6:D51)-SUM($E$6:E51)))","v":" "},null,null,null,6,"Ausblenden"]
[null,null,null,null,null,null,47,{"$f":"IF(D52+E52=0,\" \",SUM($H$5+SUM($D$6:D52)-SUM($E$6:E52)))","v":" "},null,null,null,6,"Ausblenden"]
[null,{"$f":"IF(SUM(D59:E105)<>0,\"Uebertrag\",\"Total\")","v":"Total"},null,{"$f":"SUM(D5:D52)","v":0},{"$f":"SUM(E5:E52)","v":0},null,null,{"$f":"H5+D53-E53","v":0},null,null,null,null,"Einblenden"]
[{"$f":"A1","v":"2023-07-06"},null,null,null,null,null,null,"Seite 2",null,null,null,null,{"$f":"IF(SUM($L$59:$L$105)<282,\"Einblenden\",\"Ausblenden\")","v":"Ausblenden"}]
[null,null,null,null,null,null,null,null,null,null,null,null,{"$f":"IF(SUM($L$59:$L$105)<282,\"Einblenden\",\"Ausblenden\")","v":"Ausblenden"}]
["Datum:","Text","FIBU","Einnahmen","Ausgaben",{"$f":"F3","v":"?"},null,"Saldo",null,null,null,null,{"$f":"IF(SUM($L$59:$L$105)<282,\"Einblenden\",\"Ausblenden\")","v":"Ausblenden"}]
[null,null,null,null,null,null,null,null,null,null,null,null,{"$f":"IF(SUM($L$59:$L$105)<282,\"Einblenden\",\"Ausblenden\")","v":"Ausblenden"}]
[null,"Uebertrag",null,{"$f":"D53","v":0},{"$f":"E53","v":0},null,null,{"$f":"H53","v":0},null,null,null,null,{"$f":"IF(SUM($L$59:$L$105)<282,\"Einblenden\",\"Ausblenden\")","v":"Ausblenden"}]
[null,null,null,null,null,null,48,{"$f":"IF(D59+E59=0,\" \",SUM($H$5+SUM($D$6:$D$52,$D$59:D59)-SUM($E$6:$E$52,$E$59:E59)))","v":" "},null,null,null,{"$f":"COUNTIF(A59:F59,\"\")","v":6},{"$f":"IF(L59<6,\"Einblenden\",\"Ausblenden\")","v":"Ausblenden"}]
[null,null,null,null,null,null,49,{"$f":"IF(D60+E60=0,\" \",SUM($H$5+SUM($D$6:$D$52,$D$59:D60)-SUM($E$6:$E$52,$E$59:E60)))","v":" "},null,null,null,{"$f":"COUNTIF(A60:F60,\"\")","v":6},{"$f":"IF(L60<6,\"Einblenden\",\"Ausblenden\")","v":"Ausblenden"}]
[null,null,null,null,null,null,50,{"$f":"IF(D61+E61=0,\" \",SUM($H$5+SUM($D$6:$D$52,$D$59:D61)-SUM($E$6:$E$52,$E$59:E61)))","v":" "},null,null,null,6,"Ausblenden"]
[null,null,null,null,null,null,51,{"$f":"IF(D62+E62=0,\" \",SUM($H$5+SUM($D$6:$D$52,$D$59:D62)-SUM($E$6:$E$52,$E$59:E62)))","v":" "},null,null,null,6,"Ausblenden"]
[null,null,null,null,null,null,52,{"$f":"IF(D63+E63=0,\" \",SUM($H$5+SUM($D$6:$D$52,$D$59:D63)-SUM($E$6:$E$52,$E$59:E63)))","v":" "},null,null,null,6,"Ausblenden"]
[null,null,null,null,null,null,53,{"$f":"IF(D64+E64=0,\" \",SUM($H$5+SUM($D$6:$D$52,$D$59:D64)-SUM($E$6:$E$52,$E$59:E64)))","v":" "},null,null,null,6,"Ausblenden"]
[null,null,null,null,null,null,54,{"$f":"IF(D65+E65=0,\" \",SUM($H$5+SUM($D$6:$D$52,$D$59:D65)-SUM($E$6:$E$52,$E$59:E65)))","v":" "},null,null,null,6,"Ausblenden"]
[null,null,null,null,null,null,55,{"$f":"IF(D66+E66=0,\" \",SUM($H$5+SUM($D$6:$D$52,$D$59:D66)-SUM($E$6:$E$52,$E$59:E66)))","v":" "},null,null,null,6,"Ausblenden"]
[null,null,null,null,null,null,56,{"$f":"IF(D67+E67=0,\" \",SUM($H$5+SUM($D$6:$D$52,$D$59:D67)-SUM($E$6:$E$52,$E$59:E67)))","v":" "},null,null,null,6,"Ausblenden"]
[null,null,null,null,null,null,57,{"$f":"IF(D68+E68=0,\" \",SUM($H$5+SUM($D$6:$D$52,$D$59:D68)-SUM($E$6:$E$52,$E$59:E68)))","v":" "},null,null,null,6,"Ausblenden"]
[null,null,null,null,null,null,58,{"$f":"IF(D69+E69=0,\" \",SUM($H$5+SUM($D$6:$D$52,$D$59:D69)-SUM($E$6:$E$52,$E$59:E69)))","v":" "},null,null,null,6,"Ausblenden"]
[null,null,null,null,null,null,59,{"$f":"IF(D70+E70=0,\" \",SUM($H$5+SUM($D$6:$D$52,$D$59:D70)-SUM($E$6:$E$52,$E$59:E70)))","v":" "},null,null,null,6,"Ausblenden"]
[null,null,null,null,null,null,60,{"$f":"IF(D71+E71=0,\" \",SUM($H$5+SUM($D$6:$D$52,$D$59:D71)-SUM($E$6:$E$52,$E$59:E71)))","v":" "},null,null,null,6,"Ausblenden"]
[null,null,null,null,null,null,61,{"$f":"IF(D72+E72=0,\" \",SUM($H$5+SUM($D$6:$D$52,$D$59:D72)-SUM($E$6:$E$52,$E$59:E72)))","v":" "},null,null,null,6,"Ausblenden"]
[null,null,null,null,null,null,62,{"$f":"IF(D73+E73=0,\" \",SUM($H$5+SUM($D$6:$D$52,$D$59:D73)-SUM($E$6:$E$52,$E$59:E73)))","v":" "},null,null,null,6,"Ausblenden"]
[null,null,null,null,null,null,63,{"$f":"IF(D74+E74=0,\" \",SUM($H$5+SUM($D$6:$D$52,$D$59:D74)-SUM($E$6:$E$52,$E$59:E74)))","v":" "},null,null,null,6,"Ausblenden"]
[null,null,null,null,null,null,64,{"$f":"IF(D75+E75=0,\" \",SUM($H$5+SUM($D$6:$D$52,$D$59:D75)-SUM($E$6:$E$52,$E$59:E75)))","v":" "},null,null,null,6,"Ausblenden"]
[null,null,null,null,null,null,65,{"$f":"IF(D76+E76=0,\" \",SUM($H$5+SUM($D$6:$D$52,$D$59:D76)-SUM($E$6:$E$52,$E$59:E76)))","v":" "},null,null,null,6,"Ausblenden"]
[null,null,null,null,null,null,66,{"$f":"IF(D77+E77=0,\" \",SUM($H$5+SUM($D$6:$D$52,$D$59:D77)-SUM($E$6:$E$52,$E$59:E77)))","v":" "},null,null,null,6,"Ausblenden"]
[null,null,null,null,null,null,67,{"$f":"IF(D78+E78=0,\" \",SUM($H$5+SUM($D$6:$D$52,$D$59:D78)-SUM($E$6:$E$52,$E$59:E78)))","v":" "},null,null,null,6,"Ausblenden"]
[null,null,null,null,null,null,68,{"$f":"IF(D79+E79=0,\" \",SUM($H$5+SUM($D$6:$D$52,$D$59:D79)-SUM($E$6:$E$52,$E$59:E79)))","v":" "},null,null,null,6,"Ausblenden"]
[null,null,null,null,null,null,69,{"$f":"IF(D80+E80=0,\" \",SUM($H$5+SUM($D$6:$D$52,$D$59:D80)-SUM($E$6:$E$52,$E$59:E80)))","v":" "},null,null,null,6,"Ausblenden"]
[null,null,null,null,null,null,70,{"$f":"IF(D81+E81=0,\" \",SUM($H$5+SUM($D$6:$D$52,$D$59:D81)-SUM($E$6:$E$52,$E$59:E81)))","v":" "},null,null,null,6,"Ausblenden"]
[null,null,null,null,null,null,71,{"$f":"IF(D82+E82=0,\" \",SUM($H$5+SUM($D$6:$D$52,$D$59:D82)-SUM($E$6:$E$52,$E$59:E82)))","v":" "},null,null,null,6,"Ausblenden"]
[null,null,null,null,null,null,72,{"$f":"IF(D83+E83=0,\" \",SUM($H$5+SUM($D$6:$D$52,$D$59:D83)-SUM($E$6:$E$52,$E$59:E83)))","v":" "},null,null,null,6,"Ausblenden"]
[null,null,null,null,null,null,73,{"$f":"IF(D84+E84=0,\" \",SUM($H$5+SUM($D$6:$D$52,$D$59:D84)-SUM($E$6:$E$52,$E$59:E84)))","v":" "},null,null,null,6,"Ausblenden"]
[null,null,null,null,null,null,74,{"$f":"IF(D85+E85=0,\" \",SUM($H$5+SUM($D$6:$D$52,$D$59:D85)-SUM($E$6:$E$52,$E$59:E85)))","v":" "},null,null,null,6,"Ausblenden"]
[null,null,null,null,null,null,75,{"$f":"IF(D86+E86=0,\" \",SUM($H$5+SUM($D$6:$D$52,$D$59:D86)-SUM($E$6:$E$52,$E$59:E86)))","v":" "},null,null,null,6,"Ausblenden"]
[null,null,null,null,null,null,76,{"$f":"IF(D87+E87=0,\" \",SUM($H$5+SUM($D$6:$D$52,$D$59:D87)-SUM($E$6:$E$52,$E$59:E87)))","v":" "},null,null,null,6,"Ausblenden"]
[null,null,null,null,null,null,77,{"$f":"IF(D88+E88=0,\" \",SUM($H$5+SUM($D$6:$D$52,$D$59:D88)-SUM($E$6:$E$52,$E$59:E88)))","v":" "},null,null,null,6,"Ausblenden"]
[null,null,null,null,null,null,78,{"$f":"IF(D89+E89=0,\" \",SUM($H$5+SUM($D$6:$D$52,$D$59:D89)-SUM($E$6:$E$52,$E$59:E89)))","v":" "},null,null,null,6,"Ausblenden"]
[null,null,null,null,null,null,79,{"$f":"IF(D90+E90=0,\" \",SUM($H$5+SUM($D$6:$D$52,$D$59:D90)-SUM($E$6:$E$52,$E$59:E90)))","v":" "},null,null,null,6,"Ausblenden"]
[null,null,null,null,null,null,80,{"$f":"IF(D91+E91=0,\" \",SUM($H$5+SUM($D$6:$D$52,$D$59:D91)-SUM($E$6:$E$52,$E$59:E91)))","v":" "},null,null,null,6,"Ausblenden"]
[null,null,null,null,null,null,81,{"$f":"IF(D92+E92=0,\" \",SUM($H$5+SUM($D$6:$D$52,$D$59:D92)-SUM($E$6:$E$52,$E$59:E92)))","v":" "},null,null,null,6,"Ausblenden"]
[null,null,null,null,null,null,82,{"$f":"IF(D93+E93=0,\" \",SUM($H$5+SUM($D$6:$D$52,$D$59:D93)-SUM($E$6:$E$52,$E$59:E93)))","v":" "},null,null,null,6,"Ausblenden"]
[null,null,null,null,null,null,83,{"$f":"IF(D94+E94=0,\" \",SUM($H$5+SUM($D$6:$D$52,$D$59:D94)-SUM($E$6:$E$52,$E$59:E94)))","v":" "},null,null,null,6,"Ausblenden"]
[null,null,null,null,null,null,84,{"$f":"IF(D95+E95=0,\" \",SUM($H$5+SUM($D$6:$D$52,$D$59:D95)-SUM($E$6:$E$52,$E$59:E95)))","v":" "},null,null,null,6,"Ausblenden"]
[null,null,null,null,null,null,85,{"$f":"IF(D96+E96=0,\" \",SUM($H$5+SUM($D$6:$D$52,$D$59:D96)-SUM($E$6:$E$52,$E$59:E96)))","v":" "},null,null,null,6,"Ausblenden"]
[null,null,null,null,null,null,86,{"$f":"IF(D97+E97=0,\" \",SUM($H$5+SUM($D$6:$D$52,$D$59:D97)-SUM($E$6:$E$52,$E$59:E97)))","v":" "},null,null,null,6,"Ausblenden"]
[null,null,null,null,null,null,87,{"$f":"IF(D98+E98=0,\" \",SUM($H$5+SUM($D$6:$D$52,$D$59:D98)-SUM($E$6:$E$52,$E$59:E98)))","v":" "},null,null,null,6,"Ausblenden"]
[null,null,null,null,null,null,88,{"$f":"IF(D99+E99=0,\" \",SUM($H$5+SUM($D$6:$D$52,$D$59:D99)-SUM($E$6:$E$52,$E$59:E99)))","v":" "},null,null,null,6,"Ausblenden"]
[null,null,null,null,null,null,89,{"$f":"IF(D100+E100=0,\" \",SUM($H$5+SUM($D$6:$D$52,$D$59:D100)-SUM($E$6:$E$52,$E$59:E100)))","v":" "},null,null,null,6,"Ausblenden"]
[null,null,null,null,null,null,90,{"$f":"IF(D101+E101=0,\" \",SUM($H$5+SUM($D$6:$D$52,$D$59:D101)-SUM($E$6:$E$52,$E$59:E101)))","v":" "},null,null,null,6,"Ausblenden"]
[null,null,null,null,null,null,91,{"$f":"IF(D102+E102=0,\" \",SUM($H$5+SUM($D$6:$D$52,$D$59:D102)-SUM($E$6:$E$52,$E$59:E102)))","v":" "},null,null,null,6,"Ausblenden"]
[null,null,null,null,null,null,92,{"$f":"IF(D103+E103=0,\" \",SUM($H$5+SUM($D$6:$D$52,$D$59:D103)-SUM($E$6:$E$52,$E$59:E103)))","v":" "},null,null,null,6,"Ausblenden"]
[null,null,null,null,null,null,93,{"$f":"IF(D104+E104=0,\" \",SUM($H$5+SUM($D$6:$D$52,$D$59:D104)-SUM($E$6:$E$52,$E$59:E104)))","v":" "},null,null,null,6,"Ausblenden"]
[null,null,null,null,null,null,94,{"$f":"IF(D105+E105=0,\" \",SUM($H$5+SUM($D$6:$D$52,$D$59:D105)-SUM($E$6:$E$52,$E$59:E105)))","v":" "},null,null,null,{"$f":"COUNTIF(A105:F105,\"\")","v":6},"Ausblenden"]
[null,{"$f":"IF(SUM(D112:E158)<>0,\"Uebertrag\",\"Total\")","v":"Total"},null,{"$f":"SUM(D58:D105)","v":0},{"$f":"SUM(E58:E105)","v":0},null,null,{"$f":"$H$5+D106-E106","v":0},null,null,null,null,{"$f":"IF(SUM($L$59:$L$105)<282,\"Einblenden\",\"Ausblenden\")","v":"Ausblenden"}]
[{"$f":"A1","v":"2023-07-06"},null,null,null,null,null,null,"Seite 3",null,null,null,null,{"$f":"IF(SUM($L$112:$L$158)<282,\"Einblenden\",\"Ausblenden\")","v":"Ausblenden"}]
[null,null,null,null,null,null,null,null,null,null,null,null,{"$f":"IF(SUM($L$112:$L$158)<282,\"Einblenden\",\"Ausblenden\")","v":"Ausblenden"}]
["Datum:","Text","FIBU","Einnahmen","Ausgaben",{"$f":"F3","v":"?"},null,"Saldo",null,null,null,null,{"$f":"IF(SUM($L$112:$L$158)<282,\"Einblenden\",\"Ausblenden\")","v":"Ausblenden"}]
[null,null,null,null,null,null,null,null,null,null,null,null,{"$f":"IF(SUM($L$112:$L$158)<282,\"Einblenden\",\"Ausblenden\")","v":"Ausblenden"}]
[null,"Uebertrag",null,{"$f":"D106","v":0},{"$f":"E106","v":0},null,null,{"$f":"H106","v":0},null,null,null,null,{"$f":"IF(SUM($L$112:$L$158)<282,\"Einblenden\",\"Ausblenden\")","v":"Ausblenden"}]
[null,null,null,null,null,null,95,{"$f":"IF(D112+E112=0,\" \",SUM($H$5+SUM($D$6:$D$52,$D$59:$D$105,$D$112:D112)-SUM($E$6:$E$52,$E$59:$E$105,$E$112:E112)))","v":" "},null,null,null,{"$f":"COUNTIF(A112:F112,\"\")","v":6},{"$f":"IF(L112<6,\"Einblenden\",\"Ausblenden\")","v":"Ausblenden"}]
[null,null,null,null,null,null,96,{"$f":"IF(D113+E113=0,\" \",SUM($H$5+SUM($D$6:$D$52,$D$59:$D$105,$D$112:D113)-SUM($E$6:$E$52,$E$59:$E$105,$E$112:E113)))","v":" "},null,null,null,{"$f":"COUNTIF(A113:F113,\"\")","v":6},"Ausblenden"]
[null,null,null,null,null,null,97,{"$f":"IF(D114+E114=0,\" \",SUM($H$5+SUM($D$6:$D$52,$D$59:$D$105,$D$112:D114)-SUM($E$6:$E$52,$E$59:$E$105,$E$112:E114)))","v":" "},null,null,null,6,"Ausblenden"]
[null,null,null,null,null,null,98,{"$f":"IF(D115+E115=0,\" \",SUM($H$5+SUM($D$6:$D$52,$D$59:$D$105,$D$112:D115)-SUM($E$6:$E$52,$E$59:$E$105,$E$112:E115)))","v":" "},null,null,null,6,"Ausblenden"]
[null,null,null,null,null,null,99,{"$f":"IF(D116+E116=0,\" \",SUM($H$5+SUM($D$6:$D$52,$D$59:$D$105,$D$112:D116)-SUM($E$6:$E$52,$E$59:$E$105,$E$112:E116)))","v":" "},null,null,null,6,"Ausblenden"]
[null,null,null,null,null,null,100,{"$f":"IF(D117+E117=0,\" \",SUM($H$5+SUM($D$6:$D$52,$D$59:$D$105,$D$112:D117)-SUM($E$6:$E$52,$E$59:$E$105,$E$112:E117)))","v":" "},null,null,null,6,"Ausblenden"]
[null,null,null,null,null,null,101,{"$f":"IF(D118+E118=0,\" \",SUM($H$5+SUM($D$6:$D$52,$D$59:$D$105,$D$112:D118)-SUM($E$6:$E$52,$E$59:$E$105,$E$112:E118)))","v":" "},null,null,null,6,"Ausblenden"]
[null,null,null,null,null,null,102,{"$f":"IF(D119+E119=0,\" \",SUM($H$5+SUM($D$6:$D$52,$D$59:$D$105,$D$112:D119)-SUM($E$6:$E$52,$E$59:$E$105,$E$112:E119)))","v":" "},null,null,null,6,"Ausblenden"]
[null,null,null,null,null,null,103,{"$f":"IF(D120+E120=0,\" \",SUM($H$5+SUM($D$6:$D$52,$D$59:$D$105,$D$112:D120)-SUM($E$6:$E$52,$E$59:$E$105,$E$112:E120)))","v":" "},null,null,null,6,"Ausblenden"]
[null,null,null,null,null,null,104,{"$f":"IF(D121+E121=0,\" \",SUM($H$5+SUM($D$6:$D$52,$D$59:$D$105,$D$112:D121)-SUM($E$6:$E$52,$E$59:$E$105,$E$112:E121)))","v":" "},null,null,null,6,"Ausblenden"]
[null,null,null,null,null,null,105,{"$f":"IF(D122+E122=0,\" \",SUM($H$5+SUM($D$6:$D$52,$D$59:$D$105,$D$112:D122)-SUM($E$6:$E$52,$E$59:$E$105,$E$112:E122)))","v":" "},null,null,null,6,"Ausblenden"]
[null,null,null,null,null,null,106,{"$f":"IF(D123+E123=0,\" \",SUM($H$5+SUM($D$6:$D$52,$D$59:$D$105,$D$112:D123)-SUM($E$6:$E$52,$E$59:$E$105,$E$112:E123)))","v":" "},null,null,null,6,"Ausblenden"]
[null,null,null,null,null,null,107,{"$f":"IF(D124+E124=0,\" \",SUM($H$5+SUM($D$6:$D$52,$D$59:$D$105,$D$112:D124)-SUM($E$6:$E$52,$E$59:$E$105,$E$112:E124)))","v":" "},null,null,null,6,"Ausblenden"]
[null,null,null,null,null,null,108,{"$f":"IF(D125+E125=0,\" \",SUM($H$5+SUM($D$6:$D$52,$D$59:$D$105,$D$112:D125)-SUM($E$6:$E$52,$E$59:$E$105,$E$112:E125)))","v":" "},null,null,null,6,"Ausblenden"]
[null,null,null,null,null,null,109,{"$f":"IF(D126+E126=0,\" \",SUM($H$5+SUM($D$6:$D$52,$D$59:$D$105,$D$112:D126)-SUM($E$6:$E$52,$E$59:$E$105,$E$112:E126)))","v":" "},null,null,null,6,"Ausblenden"]
[null,null,null,null,null,null,110,{"$f":"IF(D127+E127=0,\" \",SUM($H$5+SUM($D$6:$D$52,$D$59:$D$105,$D$112:D127)-SUM($E$6:$E$52,$E$59:$E$105,$E$112:E127)))","v":" "},null,null,null,6,"Ausblenden"]
[null,null,null,null,null,null,111,{"$f":"IF(D128+E128=0,\" \",SUM($H$5+SUM($D$6:$D$52,$D$59:$D$105,$D$112:D128)-SUM($E$6:$E$52,$E$59:$E$105,$E$112:E128)))","v":" "},null,null,null,6,"Ausblenden"]
[null,null,null,null,null,null,112,{"$f":"IF(D129+E129=0,\" \",SUM($H$5+SUM($D$6:$D$52,$D$59:$D$105,$D$112:D129)-SUM($E$6:$E$52,$E$59:$E$105,$E$112:E129)))","v":" "},null,null,null,6,"Ausblenden"]
[null,null,null,null,null,null,113,{"$f":"IF(D130+E130=0,\" \",SUM($H$5+SUM($D$6:$D$52,$D$59:$D$105,$D$112:D130)-SUM($E$6:$E$52,$E$59:$E$105,$E$112:E130)))","v":" "},null,null,null,6,"Ausblenden"]
[null,null,null,null,null,null,114,{"$f":"IF(D131+E131=0,\" \",SUM($H$5+SUM($D$6:$D$52,$D$59:$D$105,$D$112:D131)-SUM($E$6:$E$52,$E$59:$E$105,$E$112:E131)))","v":" "},null,null,null,6,"Ausblenden"]
[null,null,null,null,null,null,115,{"$f":"IF(D132+E132=0,\" \",SUM($H$5+SUM($D$6:$D$52,$D$59:$D$105,$D$112:D132)-SUM($E$6:$E$52,$E$59:$E$105,$E$112:E132)))","v":" "},null,null,null,6,"Ausblenden"]
[null,null,null,null,null,null,116,{"$f":"IF(D133+E133=0,\" \",SUM($H$5+SUM($D$6:$D$52,$D$59:$D$105,$D$112:D133)-SUM($E$6:$E$52,$E$59:$E$105,$E$112:E133)))","v":" "},null,null,null,6,"Ausblenden"]
[null,null,null,null,null,null,117,{"$f":"IF(D134+E134=0,\" \",SUM($H$5+SUM($D$6:$D$52,$D$59:$D$105,$D$112:D134)-SUM($E$6:$E$52,$E$59:$E$105,$E$112:E134)))","v":" "},null,null,null,6,"Ausblenden"]
[null,null,null,null,null,null,118,{"$f":"IF(D135+E135=0,\" \",SUM($H$5+SUM($D$6:$D$52,$D$59:$D$105,$D$112:D135)-SUM($E$6:$E$52,$E$59:$E$105,$E$112:E135)))","v":" "},null,null,null,6,"Ausblenden"]
[null,null,null,null,null,null,119,{"$f":"IF(D136+E136=0,\" \",SUM($H$5+SUM($D$6:$D$52,$D$59:$D$105,$D$112:D136)-SUM($E$6:$E$52,$E$59:$E$105,$E$112:E136)))","v":" "},null,null,null,6,"Ausblenden"]
[null,null,null,null,null,null,120,{"$f":"IF(D137+E137=0,\" \",SUM($H$5+SUM($D$6:$D$52,$D$59:$D$105,$D$112:D137)-SUM($E$6:$E$52,$E$59:$E$105,$E$112:E137)))","v":" "},null,null,null,6,"Ausblenden"]
[null,null,null,null,null,null,121,{"$f":"IF(D138+E138=0,\" \",SUM($H$5+SUM($D$6:$D$52,$D$59:$D$105,$D$112:D138)-SUM($E$6:$E$52,$E$59:$E$105,$E$112:E138)))","v":" "},null,null,null,6,"Ausblenden"]
[null,null,null,null,null,null,122,{"$f":"IF(D139+E139=0,\" \",SUM($H$5+SUM($D$6:$D$52,$D$59:$D$105,$D$112:D139)-SUM($E$6:$E$52,$E$59:$E$105,$E$112:E139)))","v":" "},null,null,null,6,"Ausblenden"]
[null,null,null,null,null,null,123,{"$f":"IF(D140+E140=0,\" \",SUM($H$5+SUM($D$6:$D$52,$D$59:$D$105,$D$112:D140)-SUM($E$6:$E$52,$E$59:$E$105,$E$112:E140)))","v":" "},null,null,null,6,"Ausblenden"]
[null,null,null,null,null,null,124,{"$f":"IF(D141+E141=0,\" \",SUM($H$5+SUM($D$6:$D$52,$D$59:$D$105,$D$112:D141)-SUM($E$6:$E$52,$E$59:$E$105,$E$112:E141)))","v":" "},null,null,null,6,"Ausblenden"]
[null,null,null,null,null,null,125,{"$f":"IF(D142+E142=0,\" \",SUM($H$5+SUM($D$6:$D$52,$D$59:$D$105,$D$112:D142)-SUM($E$6:$E$52,$E$59:$E$105,$E$112:E142)))","v":" "},null,null,null,6,"Ausblenden"]
[null,null,null,null,null,null,126,{"$f":"IF(D143+E143=0,\" \",SUM($H$5+SUM($D$6:$D$52,$D$59:$D$105,$D$112:D143)-SUM($E$6:$E$52,$E$59:$E$105,$E$112:E143)))","v":" "},null,null,null,6,"Ausblenden"]
[null,null,null,null,null,null,127,{"$f":"IF(D144+E144=0,\" \",SUM($H$5+SUM($D$6:$D$52,$D$59:$D$105,$D$112:D144)-SUM($E$6:$E$52,$E$59:$E$105,$E$112:E144)))","v":" "},null,null,null,6,"Ausblenden"]
[null,null,null,null,null,null,128,{"$f":"IF(D145+E145=0,\" \",SUM($H$5+SUM($D$6:$D$52,$D$59:$D$105,$D$112:D145)-SUM($E$6:$E$52,$E$59:$E$105,$E$112:E145)))","v":" "},null,null,null,6,"Ausblenden"]
[null,null,null,null,null,null,129,{"$f":"IF(D146+E146=0,\" \",SUM($H$5+SUM($D$6:$D$52,$D$59:$D$105,$D$112:D146)-SUM($E$6:$E$52,$E$59:$E$105,$E$112:E146)))","v":" "},null,null,null,6,"Ausblenden"]
[null,null,null,null,null,null,130,{"$f":"IF(D147+E147=0,\" \",SUM($H$5+SUM($D$6:$D$52,$D$59:$D$105,$D$112:D147)-SUM($E$6:$E$52,$E$59:$E$105,$E$112:E147)))","v":" "},null,null,null,6,"Ausblenden"]
[null,null,null,null,null,null,131,{"$f":"IF(D148+E148=0,\" \",SUM($H$5+SUM($D$6:$D$52,$D$59:$D$105,$D$112:D148)-SUM($E$6:$E$52,$E$59:$E$105,$E$112:E148)))","v":" "},null,null,null,6,"Ausblenden"]
[null,null,null,null,null,null,132,{"$f":"IF(D149+E149=0,\" \",SUM($H$5+SUM($D$6:$D$52,$D$59:$D$105,$D$112:D149)-SUM($E$6:$E$52,$E$59:$E$105,$E$112:E149)))","v":" "},null,null,null,6,"Ausblenden"]
[null,null,null,null,null,null,133,{"$f":"IF(D150+E150=0,\" \",SUM($H$5+SUM($D$6:$D$52,$D$59:$D$105,$D$112:D150)-SUM($E$6:$E$52,$E$59:$E$105,$E$112:E150)))","v":" "},null,null,null,6,"Ausblenden"]
[null,null,null,null,null,null,134,{"$f":"IF(D151+E151=0,\" \",SUM($H$5+SUM($D$6:$D$52,$D$59:$D$105,$D$112:D151)-SUM($E$6:$E$52,$E$59:$E$105,$E$112:E151)))","v":" "},null,null,null,6,"Ausblenden"]
[null,null,null,null,null,null,135,{"$f":"IF(D152+E152=0,\" \",SUM($H$5+SUM($D$6:$D$52,$D$59:$D$105,$D$112:D152)-SUM($E$6:$E$52,$E$59:$E$105,$E$112:E152)))","v":" "},null,null,null,6,"Ausblenden"]
[null,null,null,null,null,null,136,{"$f":"IF(D153+E153=0,\" \",SUM($H$5+SUM($D$6:$D$52,$D$59:$D$105,$D$112:D153)-SUM($E$6:$E$52,$E$59:$E$105,$E$112:E153)))","v":" "},null,null,null,6,"Ausblenden"]
[null,null,null,null,null,null,137,{"$f":"IF(D154+E154=0,\" \",SUM($H$5+SUM($D$6:$D$52,$D$59:$D$105,$D$112:D154)-SUM($E$6:$E$52,$E$59:$E$105,$E$112:E154)))","v":" "},null,null,null,6,"Ausblenden"]
[null,null,null,null,null,null,138,{"$f":"IF(D155+E155=0,\" \",SUM($H$5+SUM($D$6:$D$52,$D$59:$D$105,$D$112:D155)-SUM($E$6:$E$52,$E$59:$E$105,$E$112:E155)))","v":" "},null,null,null,6,"Ausblenden"]
[null,null,null,null,null,null,139,{"$f":"IF(D156+E156=0,\" \",SUM($H$5+SUM($D$6:$D$52,$D$59:$D$105,$D$112:D156)-SUM($E$6:$E$52,$E$59:$E$105,$E$112:E156)))","v":" "},null,null,null,6,"Ausblenden"]
[null,null,null,null,null,null,140,{"$f":"IF(D157+E157=0,\" \",SUM($H$5+SUM($D$6:$D$52,$D$59:$D$105,$D$112:D157)-SUM($E$6:$E$52,$E$59:$E$105,$E$112:E157)))","v":" "},null,null,null,6,"Ausblenden"]
[null,null,null,null,null,null,141,{"$f":"IF(D158+E158=0,\" \",SUM($H$5+SUM($D$6:$D$52,$D$59:$D$105,$D$112:D158)-SUM($E$6:$E$52,$E$59:$E$105,$E$112:E158)))","v":" "},null,null,null,6,"Ausblenden"]
[null,"Total",null,{"$f":"SUM(D111:D158)","v":0},{"$f":"SUM(E111:E158)","v":0},null,null,{"$f":"$H$5+D159-E159","v":0},null,null,null,null,{"$f":"IF(SUM($L$112:$L$158)<282,\"Einblenden\",\"Ausblenden\")","v":"Ausblenden"}]

{"sheet":"August","index":8,"n_rows":159,"n_cols":13,"rows_kept":159,"cut":false,"hidden":false,"merged":[]}
[{"$f":"Juli!A1+31","v":"2023-08-06"}]
[]
["Datum:","Text","FIBU","Einnahmen","Ausgaben",{"$f":"Januar!F3","v":"?"},null,"Saldo"]
[]
[1,"Saldovortrag",null,null,null,null,null,{"$f":"SUM(Juli!H159)","v":0}]
[null,null,null,null,null,null,1,{"$f":"IF(D6+E6=0,\" \",SUM($H$5+SUM($D$6:D6)-SUM($E$6:E6)))","v":" "},null,null,null,null,"Einblenden"]
[null,null,null,null,null,null,2,{"$f":"IF(D7+E7=0,\" \",SUM($H$5+SUM($D$6:D7)-SUM($E$6:E7)))","v":" "},null,null,null,{"$f":"COUNTIF(A7:F7,\"\")","v":6},{"$f":"IF(L7<6,\"Einblenden\",\"Ausblenden\")","v":"Ausblenden"}]
[null,null,null,null,null,null,3,{"$f":"IF(D8+E8=0,\" \",SUM($H$5+SUM($D$6:D8)-SUM($E$6:E8)))","v":" "},null,null,null,{"$f":"COUNTIF(A8:F8,\"\")","v":6},{"$f":"IF(L8<6,\"Einblenden\",\"Ausblenden\")","v":"Ausblenden"}]
[null,null,null,null,null,null,4,{"$f":"IF(D9+E9=0,\" \",SUM($H$5+SUM($D$6:D9)-SUM($E$6:E9)))","v":" "},null,null,null,6,"Ausblenden"]
[null,null,null,null,null,null,5,{"$f":"IF(D10+E10=0,\" \",SUM($H$5+SUM($D$6:D10)-SUM($E$6:E10)))","v":" "},null,null,null,6,"Ausblenden"]
[null,null,null,null,null,null,6,{"$f":"IF(D11+E11=0,\" \",SUM($H$5+SUM($D$6:D11)-SUM($E$6:E11)))","v":" "},null,null,null,6,"Ausblenden"]
[null,null,null,null,null,null,7,{"$f":"IF(D12+E12=0,\" \",SUM($H$5+SUM($D$6:D12)-SUM($E$6:E12)))","v":" "},null,null,null,6,"Ausblenden"]
[null,null,null,null,null,null,8,{"$f":"IF(D13+E13=0,\" \",SUM($H$5+SUM($D$6:D13)-SUM($E$6:E13)))","v":" "},null,null,null,6,"Ausblenden"]
[null,null,null,null,null,null,9,{"$f":"IF(D14+E14=0,\" \",SUM($H$5+SUM($D$6:D14)-SUM($E$6:E14)))","v":" "},null,null,null,6,"Ausblenden"]
[null,null,null,null,null,null,10,{"$f":"IF(D15+E15=0,\" \",SUM($H$5+SUM($D$6:D15)-SUM($E$6:E15)))","v":" "},null,null,null,6,"Ausblenden"]
[null,null,null,null,null,null,11,{"$f":"IF(D16+E16=0,\" \",SUM($H$5+SUM($D$6:D16)-SUM($E$6:E16)))","v":" "},null,null,null,6,"Ausblenden"]
[null,null,null,null,null,null,12,{"$f":"IF(D17+E17=0,\" \",SUM($H$5+SUM($D$6:D17)-SUM($E$6:E17)))","v":" "},null,null,null,6,"Ausblenden"]
[null,null,null,null,null,null,13,{"$f":"IF(D18+E18=0,\" \",SUM($H$5+SUM($D$6:D18)-SUM($E$6:E18)))","v":" "},null,null,null,6,"Ausblenden"]
[null,null,null,null,null,null,14,{"$f":"IF(D19+E19=0,\" \",SUM($H$5+SUM($D$6:D19)-SUM($E$6:E19)))","v":" "},null,null,null,6,"Ausblenden"]
[null,null,null,null,null,null,15,{"$f":"IF(D20+E20=0,\" \",SUM($H$5+SUM($D$6:D20)-SUM($E$6:E20)))","v":" "},null,null,null,6,"Ausblenden"]
[null,null,null,null,null,null,16,{"$f":"IF(D21+E21=0,\" \",SUM($H$5+SUM($D$6:D21)-SUM($E$6:E21)))","v":" "},null,null,null,6,"Ausblenden"]
[null,null,null,null,null,null,17,{"$f":"IF(D22+E22=0,\" \",SUM($H$5+SUM($D$6:D22)-SUM($E$6:E22)))","v":" "},null,null,null,6,"Ausblenden"]
[null,null,null,null,null,null,18,{"$f":"IF(D23+E23=0,\" \",SUM($H$5+SUM($D$6:D23)-SUM($E$6:E23)))","v":" "},null,null,null,6,"Ausblenden"]
[null,null,null,null,null,null,19,{"$f":"IF(D24+E24=0,\" \",SUM($H$5+SUM($D$6:D24)-SUM($E$6:E24)))","v":" "},null,null,null,6,"Ausblenden"]
[null,null,null,null,null,null,20,{"$f":"IF(D25+E25=0,\" \",SUM($H$5+SUM($D$6:D25)-SUM($E$6:E25)))","v":" "},null,null,null,6,"Ausblenden"]
[null,null,null,null,null,null,21,{"$f":"IF(D26+E26=0,\" \",SUM($H$5+SUM($D$6:D26)-SUM($E$6:E26)))","v":" "},null,null,null,6,"Ausblenden"]
[null,null,null,null,null,null,22,{"$f":"IF(D27+E27=0,\" \",SUM($H$5+SUM($D$6:D27)-SUM($E$6:E27)))","v":" "},null,null,null,6,"Ausblenden"]
[null,null,null,null,null,null,23,{"$f":"IF(D28+E28=0,\" \",SUM($H$5+SUM($D$6:D28)-SUM($E$6:E28)))","v":" "},null,null,null,6,"Ausblenden"]
[null,null,null,null,null,null,24,{"$f":"IF(D29+E29=0,\" \",SUM($H$5+SUM($D$6:D29)-SUM($E$6:E29)))","v":" "},null,null,null,6,"Ausblenden"]
[null,null,null,null,null,null,25,{"$f":"IF(D30+E30=0,\" \",SUM($H$5+SUM($D$6:D30)-SUM($E$6:E30)))","v":" "},null,null,null,6,"Ausblenden"]
[null,null,null,null,null,null,26,{"$f":"IF(D31+E31=0,\" \",SUM($H$5+SUM($D$6:D31)-SUM($E$6:E31)))","v":" "},null,null,null,6,"Ausblenden"]
[null,null,null,null,null,null,27,{"$f":"IF(D32+E32=0,\" \",SUM($H$5+SUM($D$6:D32)-SUM($E$6:E32)))","v":" "},null,null,null,6,"Ausblenden"]
[null,null,null,null,null,null,28,{"$f":"IF(D33+E33=0,\" \",SUM($H$5+SUM($D$6:D33)-SUM($E$6:E33)))","v":" "},null,null,null,6,"Ausblenden"]
[null,null,null,null,null,null,29,{"$f":"IF(D34+E34=0,\" \",SUM($H$5+SUM($D$6:D34)-SUM($E$6:E34)))","v":" "},null,null,null,6,"Ausblenden"]
[null,null,null,null,null,null,30,{"$f":"IF(D35+E35=0,\" \",SUM($H$5+SUM($D$6:D35)-SUM($E$6:E35)))","v":" "},null,null,null,6,"Ausblenden"]
[null,null,null,null,null,null,31,{"$f":"IF(D36+E36=0,\" \",SUM($H$5+SUM($D$6:D36)-SUM($E$6:E36)))","v":" "},null,null,null,6,"Ausblenden"]
[null,null,null,null,null,null,32,{"$f":"IF(D37+E37=0,\" \",SUM($H$5+SUM($D$6:D37)-SUM($E$6:E37)))","v":" "},null,null,null,6,"Ausblenden"]
[null,null,null,null,null,null,33,{"$f":"IF(D38+E38=0,\" \",SUM($H$5+SUM($D$6:D38)-SUM($E$6:E38)))","v":" "},null,null,null,6,"Ausblenden"]
[null,null,null,null,null,null,34,{"$f":"IF(D39+E39=0,\" \",SUM($H$5+SUM($D$6:D39)-SUM($E$6:E39)))","v":" "},null,null,null,6,"Ausblenden"]
[null,null,null,null,null,null,35,{"$f":"IF(D40+E40=0,\" \",SUM($H$5+SUM($D$6:D40)-SUM($E$6:E40)))","v":" "},null,null,null,6,"Ausblenden"]
[null,null,null,null,null,null,36,{"$f":"IF(D41+E41=0,\" \",SUM($H$5+SUM($D$6:D41)-SUM($E$6:E41)))","v":" "},null,null,null,6,"Ausblenden"]
[null,null,null,null,null,null,37,{"$f":"IF(D42+E42=0,\" \",SUM($H$5+SUM($D$6:D42)-SUM($E$6:E42)))","v":" "},null,null,null,6,"Ausblenden"]
[null,null,null,null,null,null,38,{"$f":"IF(D43+E43=0,\" \",SUM($H$5+SUM($D$6:D43)-SUM($E$6:E43)))","v":" "},null,null,null,6,"Ausblenden"]
[null,null,null,null,null,null,39,{"$f":"IF(D44+E44=0,\" \",SUM($H$5+SUM($D$6:D44)-SUM($E$6:E44)))","v":" "},null,null,null,6,"Ausblenden"]
[null,null,null,null,null,null,40,{"$f":"IF(D45+E45=0,\" \",SUM($H$5+SUM($D$6:D45)-SUM($E$6:E45)))","v":" "},null,null,null,6,"Ausblenden"]
[null,null,null,null,null,null,41,{"$f":"IF(D46+E46=0,\" \",SUM($H$5+SUM($D$6:D46)-SUM($E$6:E46)))","v":" "},null,null,null,6,"Ausblenden"]
[null,null,null,null,null,null,42,{"$f":"IF(D47+E47=0,\" \",SUM($H$5+SUM($D$6:D47)-SUM($E$6:E47)))","v":" "},null,null,null,6,"Ausblenden"]
[null,null,null,null,null,null,43,{"$f":"IF(D48+E48=0,\" \",SUM($H$5+SUM($D$6:D48)-SUM($E$6:E48)))","v":" "},null,null,null,6,"Ausblenden"]
[null,null,null,null,null,null,44,{"$f":"IF(D49+E49=0,\" \",SUM($H$5+SUM($D$6:D49)-SUM($E$6:E49)))","v":" "},null,null,null,6,"Ausblenden"]
[null,null,null,null,null,null,45,{"$f":"IF(D50+E50=0,\" \",SUM($H$5+SUM($D$6:D50)-SUM($E$6:E50)))","v":" "},null,null,null,6,"Ausblenden"]
[null,null,null,null,null,null,46,{"$f":"IF(D51+E51=0,\" \",SUM($H$5+SUM($D$6:D51)-SUM($E$6:E51)))","v":" "},null,null,null,6,"Ausblenden"]
[null,null,null,null,null,null,47,{"$f":"IF(D52+E52=0,\" \",SUM($H$5+SUM($D$6:D52)-SUM($E$6:E52)))","v":" "},null,null,null,6,"Ausblenden"]
[null,{"$f":"IF(SUM(D59:E105)<>0,\"Uebertrag\",\"Total\")","v":"Total"},null,{"$f":"SUM(D5:D52)","v":0},{"$f":"SUM(E5:E52)","v":0},null,null,{"$f":"H5+D53-E53","v":0},null,null,null,null,"Einblenden"]
[{"$f":"A1","v":"2023-08-06"},null,null,null,null,null,null,"Seite 2",null,null,null,null,{"$f":"IF(SUM($L$59:$L$105)<282,\"Einblenden\",\"Ausblenden\")","v":"Ausblenden"}]
[null,null,null,null,null,null,null,null,null,null,null,null,{"$f":"IF(SUM($L$59:$L$105)<282,\"Einblenden\",\"Ausblenden\")","v":"Ausblenden"}]
["Datum:","Text","FIBU","Einnahmen","Ausgaben",{"$f":"F3","v":"?"},null,"Saldo",null,null,null,null,{"$f":"IF(SUM($L$59:$L$105)<282,\"Einblenden\",\"Ausblenden\")","v":"Ausblenden"}]
[null,null,null,null,null,null,null,null,null,null,null,null,{"$f":"IF(SUM($L$59:$L$105)<282,\"Einblenden\",\"Ausblenden\")","v":"Ausblenden"}]
[null,"Uebertrag",null,{"$f":"D53","v":0},{"$f":"E53","v":0},null,null,{"$f":"H53","v":0},null,null,null,null,{"$f":"IF(SUM($L$59:$L$105)<282,\"Einblenden\",\"Ausblenden\")","v":"Ausblenden"}]
[null,null,null,null,null,null,48,{"$f":"IF(D59+E59=0,\" \",SUM($H$5+SUM($D$6:$D$52,$D$59:D59)-SUM($E$6:$E$52,$E$59:E59)))","v":" "},null,null,null,{"$f":"COUNTIF(A59:F59,\"\")","v":6},{"$f":"IF(L59<6,\"Einblenden\",\"Ausblenden\")","v":"Ausblenden"}]
[null,null,null,null,null,null,49,{"$f":"IF(D60+E60=0,\" \",SUM($H$5+SUM($D$6:$D$52,$D$59:D60)-SUM($E$6:$E$52,$E$59:E60)))","v":" "},null,null,null,{"$f":"COUNTIF(A60:F60,\"\")","v":6},{"$f":"IF(L60<6,\"Einblenden\",\"Ausblenden\")","v":"Ausblenden"}]
[null,null,null,null,null,null,50,{"$f":"IF(D61+E61=0,\" \",SUM($H$5+SUM($D$6:$D$52,$D$59:D61)-SUM($E$6:$E$52,$E$59:E61)))","v":" "},null,null,null,6,"Ausblenden"]
[null,null,null,null,null,null,51,{"$f":"IF(D62+E62=0,\" \",SUM($H$5+SUM($D$6:$D$52,$D$59:D62)-SUM($E$6:$E$52,$E$59:E62)))","v":" "},null,null,null,6,"Ausblenden"]
[null,null,null,null,null,null,52,{"$f":"IF(D63+E63=0,\" \",SUM($H$5+SUM($D$6:$D$52,$D$59:D63)-SUM($E$6:$E$52,$E$59:E63)))","v":" "},null,null,null,6,"Ausblenden"]
[null,null,null,null,null,null,53,{"$f":"IF(D64+E64=0,\" \",SUM($H$5+SUM($D$6:$D$52,$D$59:D64)-SUM($E$6:$E$52,$E$59:E64)))","v":" "},null,null,null,6,"Ausblenden"]
[null,null,null,null,null,null,54,{"$f":"IF(D65+E65=0,\" \",SUM($H$5+SUM($D$6:$D$52,$D$59:D65)-SUM($E$6:$E$52,$E$59:E65)))","v":" "},null,null,null,6,"Ausblenden"]
[null,null,null,null,null,null,55,{"$f":"IF(D66+E66=0,\" \",SUM($H$5+SUM($D$6:$D$52,$D$59:D66)-SUM($E$6:$E$52,$E$59:E66)))","v":" "},null,null,null,6,"Ausblenden"]
[null,null,null,null,null,null,56,{"$f":"IF(D67+E67=0,\" \",SUM($H$5+SUM($D$6:$D$52,$D$59:D67)-SUM($E$6:$E$52,$E$59:E67)))","v":" "},null,null,null,6,"Ausblenden"]
[null,null,null,null,null,null,57,{"$f":"IF(D68+E68=0,\" \",SUM($H$5+SUM($D$6:$D$52,$D$59:D68)-SUM($E$6:$E$52,$E$59:E68)))","v":" "},null,null,null,6,"Ausblenden"]
[null,null,null,null,null,null,58,{"$f":"IF(D69+E69=0,\" \",SUM($H$5+SUM($D$6:$D$52,$D$59:D69)-SUM($E$6:$E$52,$E$59:E69)))","v":" "},null,null,null,6,"Ausblenden"]
[null,null,null,null,null,null,59,{"$f":"IF(D70+E70=0,\" \",SUM($H$5+SUM($D$6:$D$52,$D$59:D70)-SUM($E$6:$E$52,$E$59:E70)))","v":" "},null,null,null,6,"Ausblenden"]
[null,null,null,null,null,null,60,{"$f":"IF(D71+E71=0,\" \",SUM($H$5+SUM($D$6:$D$52,$D$59:D71)-SUM($E$6:$E$52,$E$59:E71)))","v":" "},null,null,null,6,"Ausblenden"]
[null,null,null,null,null,null,61,{"$f":"IF(D72+E72=0,\" \",SUM($H$5+SUM($D$6:$D$52,$D$59:D72)-SUM($E$6:$E$52,$E$59:E72)))","v":" "},null,null,null,6,"Ausblenden"]
[null,null,null,null,null,null,62,{"$f":"IF(D73+E73=0,\" \",SUM($H$5+SUM($D$6:$D$52,$D$59:D73)-SUM($E$6:$E$52,$E$59:E73)))","v":" "},null,null,null,6,"Ausblenden"]
[null,null,null,null,null,null,63,{"$f":"IF(D74+E74=0,\" \",SUM($H$5+SUM($D$6:$D$52,$D$59:D74)-SUM($E$6:$E$52,$E$59:E74)))","v":" "},null,null,null,6,"Ausblenden"]
[null,null,null,null,null,null,64,{"$f":"IF(D75+E75=0,\" \",SUM($H$5+SUM($D$6:$D$52,$D$59:D75)-SUM($E$6:$E$52,$E$59:E75)))","v":" "},null,null,null,6,"Ausblenden"]
[null,null,null,null,null,null,65,{"$f":"IF(D76+E76=0,\" \",SUM($H$5+SUM($D$6:$D$52,$D$59:D76)-SUM($E$6:$E$52,$E$59:E76)))","v":" "},null,null,null,6,"Ausblenden"]
[null,null,null,null,null,null,66,{"$f":"IF(D77+E77=0,\" \",SUM($H$5+SUM($D$6:$D$52,$D$59:D77)-SUM($E$6:$E$52,$E$59:E77)))","v":" "},null,null,null,6,"Ausblenden"]
[null,null,null,null,null,null,67,{"$f":"IF(D78+E78=0,\" \",SUM($H$5+SUM($D$6:$D$52,$D$59:D78)-SUM($E$6:$E$52,$E$59:E78)))","v":" "},null,null,null,6,"Ausblenden"]
[null,null,null,null,null,null,68,{"$f":"IF(D79+E79=0,\" \",SUM($H$5+SUM($D$6:$D$52,$D$59:D79)-SUM($E$6:$E$52,$E$59:E79)))","v":" "},null,null,null,6,"Ausblenden"]
[null,null,null,null,null,null,69,{"$f":"IF(D80+E80=0,\" \",SUM($H$5+SUM($D$6:$D$52,$D$59:D80)-SUM($E$6:$E$52,$E$59:E80)))","v":" "},null,null,null,6,"Ausblenden"]
[null,null,null,null,null,null,70,{"$f":"IF(D81+E81=0,\" \",SUM($H$5+SUM($D$6:$D$52,$D$59:D81)-SUM($E$6:$E$52,$E$59:E81)))","v":" "},null,null,null,6,"Ausblenden"]
[null,null,null,null,null,null,71,{"$f":"IF(D82+E82=0,\" \",SUM($H$5+SUM($D$6:$D$52,$D$59:D82)-SUM($E$6:$E$52,$E$59:E82)))","v":" "},null,null,null,6,"Ausblenden"]
[null,null,null,null,null,null,72,{"$f":"IF(D83+E83=0,\" \",SUM($H$5+SUM($D$6:$D$52,$D$59:D83)-SUM($E$6:$E$52,$E$59:E83)))","v":" "},null,null,null,6,"Ausblenden"]
[null,null,null,null,null,null,73,{"$f":"IF(D84+E84=0,\" \",SUM($H$5+SUM($D$6:$D$52,$D$59:D84)-SUM($E$6:$E$52,$E$59:E84)))","v":" "},null,null,null,6,"Ausblenden"]
[null,null,null,null,null,null,74,{"$f":"IF(D85+E85=0,\" \",SUM($H$5+SUM($D$6:$D$52,$D$59:D85)-SUM($E$6:$E$52,$E$59:E85)))","v":" "},null,null,null,6,"Ausblenden"]
[null,null,null,null,null,null,75,{"$f":"IF(D86+E86=0,\" \",SUM($H$5+SUM($D$6:$D$52,$D$59:D86)-SUM($E$6:$E$52,$E$59:E86)))","v":" "},null,null,null,6,"Ausblenden"]
[null,null,null,null,null,null,76,{"$f":"IF(D87+E87=0,\" \",SUM($H$5+SUM($D$6:$D$52,$D$59:D87)-SUM($E$6:$E$52,$E$59:E87)))","v":" "},null,null,null,6,"Ausblenden"]
[null,null,null,null,null,null,77,{"$f":"IF(D88+E88=0,\" \",SUM($H$5+SUM($D$6:$D$52,$D$59:D88)-SUM($E$6:$E$52,$E$59:E88)))","v":" "},null,null,null,6,"Ausblenden"]
[null,null,null,null,null,null,78,{"$f":"IF(D89+E89=0,\" \",SUM($H$5+SUM($D$6:$D$52,$D$59:D89)-SUM($E$6:$E$52,$E$59:E89)))","v":" "},null,null,null,6,"Ausblenden"]
[null,null,null,null,null,null,79,{"$f":"IF(D90+E90=0,\" \",SUM($H$5+SUM($D$6:$D$52,$D$59:D90)-SUM($E$6:$E$52,$E$59:E90)))","v":" "},null,null,null,6,"Ausblenden"]
[null,null,null,null,null,null,80,{"$f":"IF(D91+E91=0,\" \",SUM($H$5+SUM($D$6:$D$52,$D$59:D91)-SUM($E$6:$E$52,$E$59:E91)))","v":" "},null,null,null,6,"Ausblenden"]
[null,null,null,null,null,null,81,{"$f":"IF(D92+E92=0,\" \",SUM($H$5+SUM($D$6:$D$52,$D$59:D92)-SUM($E$6:$E$52,$E$59:E92)))","v":" "},null,null,null,6,"Ausblenden"]
[null,null,null,null,null,null,82,{"$f":"IF(D93+E93=0,\" \",SUM($H$5+SUM($D$6:$D$52,$D$59:D93)-SUM($E$6:$E$52,$E$59:E93)))","v":" "},null,null,null,6,"Ausblenden"]
[null,null,null,null,null,null,83,{"$f":"IF(D94+E94=0,\" \",SUM($H$5+SUM($D$6:$D$52,$D$59:D94)-SUM($E$6:$E$52,$E$59:E94)))","v":" "},null,null,null,6,"Ausblenden"]
[null,null,null,null,null,null,84,{"$f":"IF(D95+E95=0,\" \",SUM($H$5+SUM($D$6:$D$52,$D$59:D95)-SUM($E$6:$E$52,$E$59:E95)))","v":" "},null,null,null,6,"Ausblenden"]
[null,null,null,null,null,null,85,{"$f":"IF(D96+E96=0,\" \",SUM($H$5+SUM($D$6:$D$52,$D$59:D96)-SUM($E$6:$E$52,$E$59:E96)))","v":" "},null,null,null,6,"Ausblenden"]
[null,null,null,null,null,null,86,{"$f":"IF(D97+E97=0,\" \",SUM($H$5+SUM($D$6:$D$52,$D$59:D97)-SUM($E$6:$E$52,$E$59:E97)))","v":" "},null,null,null,6,"Ausblenden"]
[null,null,null,null,null,null,87,{"$f":"IF(D98+E98=0,\" \",SUM($H$5+SUM($D$6:$D$52,$D$59:D98)-SUM($E$6:$E$52,$E$59:E98)))","v":" "},null,null,null,6,"Ausblenden"]
[null,null,null,null,null,null,88,{"$f":"IF(D99+E99=0,\" \",SUM($H$5+SUM($D$6:$D$52,$D$59:D99)-SUM($E$6:$E$52,$E$59:E99)))","v":" "},null,null,null,6,"Ausblenden"]
[null,null,null,null,null,null,89,{"$f":"IF(D100+E100=0,\" \",SUM($H$5+SUM($D$6:$D$52,$D$59:D100)-SUM($E$6:$E$52,$E$59:E100)))","v":" "},null,null,null,6,"Ausblenden"]
[null,null,null,null,null,null,90,{"$f":"IF(D101+E101=0,\" \",SUM($H$5+SUM($D$6:$D$52,$D$59:D101)-SUM($E$6:$E$52,$E$59:E101)))","v":" "},null,null,null,6,"Ausblenden"]
[null,null,null,null,null,null,91,{"$f":"IF(D102+E102=0,\" \",SUM($H$5+SUM($D$6:$D$52,$D$59:D102)-SUM($E$6:$E$52,$E$59:E102)))","v":" "},null,null,null,6,"Ausblenden"]
[null,null,null,null,null,null,92,{"$f":"IF(D103+E103=0,\" \",SUM($H$5+SUM($D$6:$D$52,$D$59:D103)-SUM($E$6:$E$52,$E$59:E103)))","v":" "},null,null,null,6,"Ausblenden"]
[null,null,null,null,null,null,93,{"$f":"IF(D104+E104=0,\" \",SUM($H$5+SUM($D$6:$D$52,$D$59:D104)-SUM($E$6:$E$52,$E$59:E104)))","v":" "},null,null,null,6,"Ausblenden"]
[null,null,null,null,null,null,94,{"$f":"IF(D105+E105=0,\" \",SUM($H$5+SUM($D$6:$D$52,$D$59:D105)-SUM($E$6:$E$52,$E$59:E105)))","v":" "},null,null,null,{"$f":"COUNTIF(A105:F105,\"\")","v":6},"Ausblenden"]
[null,{"$f":"IF(SUM(D112:E158)<>0,\"Uebertrag\",\"Total\")","v":"Total"},null,{"$f":"SUM(D58:D105)","v":0},{"$f":"SUM(E58:E105)","v":0},null,null,{"$f":"$H$5+D106-E106","v":0},null,null,null,null,{"$f":"IF(SUM($L$59:$L$105)<282,\"Einblenden\",\"Ausblenden\")","v":"Ausblenden"}]
[{"$f":"A1","v":"2023-08-06"},null,null,null,null,null,null,"Seite 3",null,null,null,null,{"$f":"IF(SUM($L$112:$L$158)<282,\"Einblenden\",\"Ausblenden\")","v":"Ausblenden"}]
[null,null,null,null,null,null,null,null,null,null,null,null,{"$f":"IF(SUM($L$112:$L$158)<282,\"Einblenden\",\"Ausblenden\")","v":"Ausblenden"}]
["Datum:","Text","FIBU","Einnahmen","Ausgaben",{"$f":"F3","v":"?"},null,"Saldo",null,null,null,null,{"$f":"IF(SUM($L$112:$L$158)<282,\"Einblenden\",\"Ausblenden\")","v":"Ausblenden"}]
[null,null,null,null,null,null,null,null,null,null,null,null,{"$f":"IF(SUM($L$112:$L$158)<282,\"Einblenden\",\"Ausblenden\")","v":"Ausblenden"}]
[null,"Uebertrag",null,{"$f":"D106","v":0},{"$f":"E106","v":0},null,null,{"$f":"H106","v":0},null,null,null,null,{"$f":"IF(SUM($L$112:$L$158)<282,\"Einblenden\",\"Ausblenden\")","v":"Ausblenden"}]
[null,null,null,null,null,null,95,{"$f":"IF(D112+E112=0,\" \",SUM($H$5+SUM($D$6:$D$52,$D$59:$D$105,$D$112:D112)-SUM($E$6:$E$52,$E$59:$E$105,$E$112:E112)))","v":" "},null,null,null,{"$f":"COUNTIF(A112:F112,\"\")","v":6},{"$f":"IF(L112<6,\"Einblenden\",\"Ausblenden\")","v":"Ausblenden"}]
[null,null,null,null,null,null,96,{"$f":"IF(D113+E113=0,\" \",SUM($H$5+SUM($D$6:$D$52,$D$59:$D$105,$D$112:D113)-SUM($E$6:$E$52,$E$59:$E$105,$E$112:E113)))","v":" "},null,null,null,{"$f":"COUNTIF(A113:F113,\"\")","v":6},"Ausblenden"]
[null,null,null,null,null,null,97,{"$f":"IF(D114+E114=0,\" \",SUM($H$5+SUM($D$6:$D$52,$D$59:$D$105,$D$112:D114)-SUM($E$6:$E$52,$E$59:$E$105,$E$112:E114)))","v":" "},null,null,null,6,"Ausblenden"]
[null,null,null,null,null,null,98,{"$f":"IF(D115+E115=0,\" \",SUM($H$5+SUM($D$6:$D$52,$D$59:$D$105,$D$112:D115)-SUM($E$6:$E$52,$E$59:$E$105,$E$112:E115)))","v":" "},null,null,null,6,"Ausblenden"]
[null,null,null,null,null,null,99,{"$f":"IF(D116+E116=0,\" \",SUM($H$5+SUM($D$6:$D$52,$D$59:$D$105,$D$112:D116)-SUM($E$6:$E$52,$E$59:$E$105,$E$112:E116)))","v":" "},null,null,null,6,"Ausblenden"]
[null,null,null,null,null,null,100,{"$f":"IF(D117+E117=0,\" \",SUM($H$5+SUM($D$6:$D$52,$D$59:$D$105,$D$112:D117)-SUM($E$6:$E$52,$E$59:$E$105,$E$112:E117)))","v":" "},null,null,null,6,"Ausblenden"]
[null,null,null,null,null,null,101,{"$f":"IF(D118+E118=0,\" \",SUM($H$5+SUM($D$6:$D$52,$D$59:$D$105,$D$112:D118)-SUM($E$6:$E$52,$E$59:$E$105,$E$112:E118)))","v":" "},null,null,null,6,"Ausblenden"]
[null,null,null,null,null,null,102,{"$f":"IF(D119+E119=0,\" \",SUM($H$5+SUM($D$6:$D$52,$D$59:$D$105,$D$112:D119)-SUM($E$6:$E$52,$E$59:$E$105,$E$112:E119)))","v":" "},null,null,null,6,"Ausblenden"]
[null,null,null,null,null,null,103,{"$f":"IF(D120+E120=0,\" \",SUM($H$5+SUM($D$6:$D$52,$D$59:$D$105,$D$112:D120)-SUM($E$6:$E$52,$E$59:$E$105,$E$112:E120)))","v":" "},null,null,null,6,"Ausblenden"]
[null,null,null,null,null,null,104,{"$f":"IF(D121+E121=0,\" \",SUM($H$5+SUM($D$6:$D$52,$D$59:$D$105,$D$112:D121)-SUM($E$6:$E$52,$E$59:$E$105,$E$112:E121)))","v":" "},null,null,null,6,"Ausblenden"]
[null,null,null,null,null,null,105,{"$f":"IF(D122+E122=0,\" \",SUM($H$5+SUM($D$6:$D$52,$D$59:$D$105,$D$112:D122)-SUM($E$6:$E$52,$E$59:$E$105,$E$112:E122)))","v":" "},null,null,null,6,"Ausblenden"]
[null,null,null,null,null,null,106,{"$f":"IF(D123+E123=0,\" \",SUM($H$5+SUM($D$6:$D$52,$D$59:$D$105,$D$112:D123)-SUM($E$6:$E$52,$E$59:$E$105,$E$112:E123)))","v":" "},null,null,null,6,"Ausblenden"]
[null,null,null,null,null,null,107,{"$f":"IF(D124+E124=0,\" \",SUM($H$5+SUM($D$6:$D$52,$D$59:$D$105,$D$112:D124)-SUM($E$6:$E$52,$E$59:$E$105,$E$112:E124)))","v":" "},null,null,null,6,"Ausblenden"]
[null,null,null,null,null,null,108,{"$f":"IF(D125+E125=0,\" \",SUM($H$5+SUM($D$6:$D$52,$D$59:$D$105,$D$112:D125)-SUM($E$6:$E$52,$E$59:$E$105,$E$112:E125)))","v":" "},null,null,null,6,"Ausblenden"]
[null,null,null,null,null,null,109,{"$f":"IF(D126+E126=0,\" \",SUM($H$5+SUM($D$6:$D$52,$D$59:$D$105,$D$112:D126)-SUM($E$6:$E$52,$E$59:$E$105,$E$112:E126)))","v":" "},null,null,null,6,"Ausblenden"]
[null,null,null,null,null,null,110,{"$f":"IF(D127+E127=0,\" \",SUM($H$5+SUM($D$6:$D$52,$D$59:$D$105,$D$112:D127)-SUM($E$6:$E$52,$E$59:$E$105,$E$112:E127)))","v":" "},null,null,null,6,"Ausblenden"]
[null,null,null,null,null,null,111,{"$f":"IF(D128+E128=0,\" \",SUM($H$5+SUM($D$6:$D$52,$D$59:$D$105,$D$112:D128)-SUM($E$6:$E$52,$E$59:$E$105,$E$112:E128)))","v":" "},null,null,null,6,"Ausblenden"]
[null,null,null,null,null,null,112,{"$f":"IF(D129+E129=0,\" \",SUM($H$5+SUM($D$6:$D$52,$D$59:$D$105,$D$112:D129)-SUM($E$6:$E$52,$E$59:$E$105,$E$112:E129)))","v":" "},null,null,null,6,"Ausblenden"]
[null,null,null,null,null,null,113,{"$f":"IF(D130+E130=0,\" \",SUM($H$5+SUM($D$6:$D$52,$D$59:$D$105,$D$112:D130)-SUM($E$6:$E$52,$E$59:$E$105,$E$112:E130)))","v":" "},null,null,null,6,"Ausblenden"]
[null,null,null,null,null,null,114,{"$f":"IF(D131+E131=0,\" \",SUM($H$5+SUM($D$6:$D$52,$D$59:$D$105,$D$112:D131)-SUM($E$6:$E$52,$E$59:$E$105,$E$112:E131)))","v":" "},null,null,null,6,"Ausblenden"]
[null,null,null,null,null,null,115,{"$f":"IF(D132+E132=0,\" \",SUM($H$5+SUM($D$6:$D$52,$D$59:$D$105,$D$112:D132)-SUM($E$6:$E$52,$E$59:$E$105,$E$112:E132)))","v":" "},null,null,null,6,"Ausblenden"]
[null,null,null,null,null,null,116,{"$f":"IF(D133+E133=0,\" \",SUM($H$5+SUM($D$6:$D$52,$D$59:$D$105,$D$112:D133)-SUM($E$6:$E$52,$E$59:$E$105,$E$112:E133)))","v":" "},null,null,null,6,"Ausblenden"]
[null,null,null,null,null,null,117,{"$f":"IF(D134+E134=0,\" \",SUM($H$5+SUM($D$6:$D$52,$D$59:$D$105,$D$112:D134)-SUM($E$6:$E$52,$E$59:$E$105,$E$112:E134)))","v":" "},null,null,null,6,"Ausblenden"]
[null,null,null,null,null,null,118,{"$f":"IF(D135+E135=0,\" \",SUM($H$5+SUM($D$6:$D$52,$D$59:$D$105,$D$112:D135)-SUM($E$6:$E$52,$E$59:$E$105,$E$112:E135)))","v":" "},null,null,null,6,"Ausblenden"]
[null,null,null,null,null,null,119,{"$f":"IF(D136+E136=0,\" \",SUM($H$5+SUM($D$6:$D$52,$D$59:$D$105,$D$112:D136)-SUM($E$6:$E$52,$E$59:$E$105,$E$112:E136)))","v":" "},null,null,null,6,"Ausblenden"]
[null,null,null,null,null,null,120,{"$f":"IF(D137+E137=0,\" \",SUM($H$5+SUM($D$6:$D$52,$D$59:$D$105,$D$112:D137)-SUM($E$6:$E$52,$E$59:$E$105,$E$112:E137)))","v":" "},null,null,null,6,"Ausblenden"]
[null,null,null,null,null,null,121,{"$f":"IF(D138+E138=0,\" \",SUM($H$5+SUM($D$6:$D$52,$D$59:$D$105,$D$112:D138)-SUM($E$6:$E$52,$E$59:$E$105,$E$112:E138)))","v":" "},null,null,null,6,"Ausblenden"]
[null,null,null,null,null,null,122,{"$f":"IF(D139+E139=0,\" \",SUM($H$5+SUM($D$6:$D$52,$D$59:$D$105,$D$112:D139)-SUM($E$6:$E$52,$E$59:$E$105,$E$112:E139)))","v":" "},null,null,null,6,"Ausblenden"]
[null,null,null,null,null,null,123,{"$f":"IF(D140+E140=0,\" \",SUM($H$5+SUM($D$6:$D$52,$D$59:$D$105,$D$112:D140)-SUM($E$6:$E$52,$E$59:$E$105,$E$112:E140)))","v":" "},null,null,null,6,"Ausblenden"]
[null,null,null,null,null,null,124,{"$f":"IF(D141+E141=0,\" \",SUM($H$5+SUM($D$6:$D$52,$D$59:$D$105,$D$112:D141)-SUM($E$6:$E$52,$E$59:$E$105,$E$112:E141)))","v":" "},null,null,null,6,"Ausblenden"]
[null,null,null,null,null,null,125,{"$f":"IF(D142+E142=0,\" \",SUM($H$5+SUM($D$6:$D$52,$D$59:$D$105,$D$112:D142)-SUM($E$6:$E$52,$E$59:$E$105,$E$112:E142)))","v":" "},null,null,null,6,"Ausblenden"]
[null,null,null,null,null,null,126,{"$f":"IF(D143+E143=0,\" \",SUM($H$5+SUM($D$6:$D$52,$D$59:$D$105,$D$112:D143)-SUM($E$6:$E$52,$E$59:$E$105,$E$112:E143)))","v":" "},null,null,null,6,"Ausblenden"]
[null,null,null,null,null,null,127,{"$f":"IF(D144+E144=0,\" \",SUM($H$5+SUM($D$6:$D$52,$D$59:$D$105,$D$112:D144)-SUM($E$6:$E$52,$E$59:$E$105,$E$112:E144)))","v":" "},null,null,null,6,"Ausblenden"]
[null,null,null,null,null,null,128,{"$f":"IF(D145+E145=0,\" \",SUM($H$5+SUM($D$6:$D$52,$D$59:$D$105,$D$112:D145)-SUM($E$6:$E$52,$E$59:$E$105,$E$112:E145)))","v":" "},null,null,null,6,"Ausblenden"]
[null,null,null,null,null,null,129,{"$f":"IF(D146+E146=0,\" \",SUM($H$5+SUM($D$6:$D$52,$D$59:$D$105,$D$112:D146)-SUM($E$6:$E$52,$E$59:$E$105,$E$112:E146)))","v":" "},null,null,null,6,"Ausblenden"]
[null,null,null,null,null,null,130,{"$f":"IF(D147+E147=0,\" \",SUM($H$5+SUM($D$6:$D$52,$D$59:$D$105,$D$112:D147)-SUM($E$6:$E$52,$E$59:$E$105,$E$112:E147)))","v":" "},null,null,null,6,"Ausblenden"]
[null,null,null,null,null,null,131,{"$f":"IF(D148+E148=0,\" \",SUM($H$5+SUM($D$6:$D$52,$D$59:$D$105,$D$112:D148)-SUM($E$6:$E$52,$E$59:$E$105,$E$112:E148)))","v":" "},null,null,null,6,"Ausblenden"]
[null,null,null,null,null,null,132,{"$f":"IF(D149+E149=0,\" \",SUM($H$5+SUM($D$6:$D$52,$D$59:$D$105,$D$112:D149)-SUM($E$6:$E$52,$E$59:$E$105,$E$112:E149)))","v":" "},null,null,null,6,"Ausblenden"]
[null,null,null,null,null,null,133,{"$f":"IF(D150+E150=0,\" \",SUM($H$5+SUM($D$6:$D$52,$D$59:$D$105,$D$112:D150)-SUM($E$6:$E$52,$E$59:$E$105,$E$112:E150)))","v":" "},null,null,null,6,"Ausblenden"]
[null,null,null,null,null,null,134,{"$f":"IF(D151+E151=0,\" \",SUM($H$5+SUM($D$6:$D$52,$D$59:$D$105,$D$112:D151)-SUM($E$6:$E$52,$E$59:$E$105,$E$112:E151)))","v":" "},null,null,null,6,"Ausblenden"]
[null,null,null,null,null,null,135,{"$f":"IF(D152+E152=0,\" \",SUM($H$5+SUM($D$6:$D$52,$D$59:$D$105,$D$112:D152)-SUM($E$6:$E$52,$E$59:$E$105,$E$112:E152)))","v":" "},null,null,null,6,"Ausblenden"]
[null,null,null,null,null,null,136,{"$f":"IF(D153+E153=0,\" \",SUM($H$5+SUM($D$6:$D$52,$D$59:$D$105,$D$112:D153)-SUM($E$6:$E$52,$E$59:$E$105,$E$112:E153)))","v":" "},null,null,null,6,"Ausblenden"]
[null,null,null,null,null,null,137,{"$f":"IF(D154+E154=0,\" \",SUM($H$5+SUM($D$6:$D$52,$D$59:$D$105,$D$112:D154)-SUM($E$6:$E$52,$E$59:$E$105,$E$112:E154)))","v":" "},null,null,null,6,"Ausblenden"]
[null,null,null,null,null,null,138,{"$f":"IF(D155+E155=0,\" \",SUM($H$5+SUM($D$6:$D$52,$D$59:$D$105,$D$112:D155)-SUM($E$6:$E$52,$E$59:$E$105,$E$112:E155)))","v":" "},null,null,null,6,"Ausblenden"]
[null,null,null,null,null,null,139,{"$f":"IF(D156+E156=0,\" \",SUM($H$5+SUM($D$6:$D$52,$D$59:$D$105,$D$112:D156)-SUM($E$6:$E$52,$E$59:$E$105,$E$112:E156)))","v":" "},null,null,null,6,"Ausblenden"]
[null,null,null,null,null,null,140,{"$f":"IF(D157+E157=0,\" \",SUM($H$5+SUM($D$6:$D$52,$D$59:$D$105,$D$112:D157)-SUM($E$6:$E$52,$E$59:$E$105,$E$112:E157)))","v":" "},null,null,null,6,"Ausblenden"]
[null,null,null,null,null,null,141,{"$f":"IF(D158+E158=0,\" \",SUM($H$5+SUM($D$6:$D$52,$D$59:$D$105,$D$112:D158)-SUM($E$6:$E$52,$E$59:$E$105,$E$112:E158)))","v":" "},null,null,null,6,"Ausblenden"]
[null,"Total",null,{"$f":"SUM(D111:D158)","v":0},{"$f":"SUM(E111:E158)","v":0},null,null,{"$f":"$H$5+D159-E159","v":0},null,null,null,null,{"$f":"IF(SUM($L$112:$L$158)<282,\"Einblenden\",\"Ausblenden\")","v":"Ausblenden"}]

{"sheet":"September","index":9,"n_rows":159,"n_cols":13,"rows_kept":159,"cut":false,"hidden":false,"merged":[]}
[{"$f":"August!A1+31","v":"2023-09-06"}]
[]
["Datum:","Text","FIBU","Einnahmen","Ausgaben",{"$f":"Januar!F3","v":"?"},null,"Saldo"]
[]
[1,"Saldovortrag",null,null,null,null,null,{"$f":"SUM(August!H159)","v":0}]
[null,null,null,null,null,null,1,{"$f":"IF(D6+E6=0,\" \",SUM($H$5+SUM($D$6:D6)-SUM($E$6:E6)))","v":" "},null,null,null,null,"Einblenden"]
[null,null,null,null,null,null,2,{"$f":"IF(D7+E7=0,\" \",SUM($H$5+SUM($D$6:D7)-SUM($E$6:E7)))","v":" "},null,null,null,{"$f":"COUNTIF(A7:F7,\"\")","v":6},{"$f":"IF(L7<6,\"Einblenden\",\"Ausblenden\")","v":"Ausblenden"}]
[null,null,null,null,null,null,3,{"$f":"IF(D8+E8=0,\" \",SUM($H$5+SUM($D$6:D8)-SUM($E$6:E8)))","v":" "},null,null,null,{"$f":"COUNTIF(A8:F8,\"\")","v":6},{"$f":"IF(L8<6,\"Einblenden\",\"Ausblenden\")","v":"Ausblenden"}]
[null,null,null,null,null,null,4,{"$f":"IF(D9+E9=0,\" \",SUM($H$5+SUM($D$6:D9)-SUM($E$6:E9)))","v":" "},null,null,null,6,"Ausblenden"]
[null,null,null,null,null,null,5,{"$f":"IF(D10+E10=0,\" \",SUM($H$5+SUM($D$6:D10)-SUM($E$6:E10)))","v":" "},null,null,null,6,"Ausblenden"]
[null,null,null,null,null,null,6,{"$f":"IF(D11+E11=0,\" \",SUM($H$5+SUM($D$6:D11)-SUM($E$6:E11)))","v":" "},null,null,null,6,"Ausblenden"]
[null,null,null,null,null,null,7,{"$f":"IF(D12+E12=0,\" \",SUM($H$5+SUM($D$6:D12)-SUM($E$6:E12)))","v":" "},null,null,null,6,"Ausblenden"]
[null,null,null,null,null,null,8,{"$f":"IF(D13+E13=0,\" \",SUM($H$5+SUM($D$6:D13)-SUM($E$6:E13)))","v":" "},null,null,null,6,"Ausblenden"]
[null,null,null,null,null,null,9,{"$f":"IF(D14+E14=0,\" \",SUM($H$5+SUM($D$6:D14)-SUM($E$6:E14)))","v":" "},null,null,null,6,"Ausblenden"]
[null,null,null,null,null,null,10,{"$f":"IF(D15+E15=0,\" \",SUM($H$5+SUM($D$6:D15)-SUM($E$6:E15)))","v":" "},null,null,null,6,"Ausblenden"]
[null,null,null,null,null,null,11,{"$f":"IF(D16+E16=0,\" \",SUM($H$5+SUM($D$6:D16)-SUM($E$6:E16)))","v":" "},null,null,null,6,"Ausblenden"]
[null,null,null,null,null,null,12,{"$f":"IF(D17+E17=0,\" \",SUM($H$5+SUM($D$6:D17)-SUM($E$6:E17)))","v":" "},null,null,null,6,"Ausblenden"]
[null,null,null,null,null,null,13,{"$f":"IF(D18+E18=0,\" \",SUM($H$5+SUM($D$6:D18)-SUM($E$6:E18)))","v":" "},null,null,null,6,"Ausblenden"]
[null,null,null,null,null,null,14,{"$f":"IF(D19+E19=0,\" \",SUM($H$5+SUM($D$6:D19)-SUM($E$6:E19)))","v":" "},null,null,null,6,"Ausblenden"]
[null,null,null,null,null,null,15,{"$f":"IF(D20+E20=0,\" \",SUM($H$5+SUM($D$6:D20)-SUM($E$6:E20)))","v":" "},null,null,null,6,"Ausblenden"]
[null,null,null,null,null,null,16,{"$f":"IF(D21+E21=0,\" \",SUM($H$5+SUM($D$6:D21)-SUM($E$6:E21)))","v":" "},null,null,null,6,"Ausblenden"]
[null,null,null,null,null,null,17,{"$f":"IF(D22+E22=0,\" \",SUM($H$5+SUM($D$6:D22)-SUM($E$6:E22)))","v":" "},null,null,null,6,"Ausblenden"]
[null,null,null,null,null,null,18,{"$f":"IF(D23+E23=0,\" \",SUM($H$5+SUM($D$6:D23)-SUM($E$6:E23)))","v":" "},null,null,null,6,"Ausblenden"]
[null,null,null,null,null,null,19,{"$f":"IF(D24+E24=0,\" \",SUM($H$5+SUM($D$6:D24)-SUM($E$6:E24)))","v":" "},null,null,null,6,"Ausblenden"]
[null,null,null,null,null,null,20,{"$f":"IF(D25+E25=0,\" \",SUM($H$5+SUM($D$6:D25)-SUM($E$6:E25)))","v":" "},null,null,null,6,"Ausblenden"]
[null,null,null,null,null,null,21,{"$f":"IF(D26+E26=0,\" \",SUM($H$5+SUM($D$6:D26)-SUM($E$6:E26)))","v":" "},null,null,null,6,"Ausblenden"]
[null,null,null,null,null,null,22,{"$f":"IF(D27+E27=0,\" \",SUM($H$5+SUM($D$6:D27)-SUM($E$6:E27)))","v":" "},null,null,null,6,"Ausblenden"]
[null,null,null,null,null,null,23,{"$f":"IF(D28+E28=0,\" \",SUM($H$5+SUM($D$6:D28)-SUM($E$6:E28)))","v":" "},null,null,null,6,"Ausblenden"]
[null,null,null,null,null,null,24,{"$f":"IF(D29+E29=0,\" \",SUM($H$5+SUM($D$6:D29)-SUM($E$6:E29)))","v":" "},null,null,null,6,"Ausblenden"]
[null,null,null,null,null,null,25,{"$f":"IF(D30+E30=0,\" \",SUM($H$5+SUM($D$6:D30)-SUM($E$6:E30)))","v":" "},null,null,null,6,"Ausblenden"]
[null,null,null,null,null,null,26,{"$f":"IF(D31+E31=0,\" \",SUM($H$5+SUM($D$6:D31)-SUM($E$6:E31)))","v":" "},null,null,null,6,"Ausblenden"]
[null,null,null,null,null,null,27,{"$f":"IF(D32+E32=0,\" \",SUM($H$5+SUM($D$6:D32)-SUM($E$6:E32)))","v":" "},null,null,null,6,"Ausblenden"]
[null,null,null,null,null,null,28,{"$f":"IF(D33+E33=0,\" \",SUM($H$5+SUM($D$6:D33)-SUM($E$6:E33)))","v":" "},null,null,null,6,"Ausblenden"]
[null,null,null,null,null,null,29,{"$f":"IF(D34+E34=0,\" \",SUM($H$5+SUM($D$6:D34)-SUM($E$6:E34)))","v":" "},null,null,null,6,"Ausblenden"]
[null,null,null,null,null,null,30,{"$f":"IF(D35+E35=0,\" \",SUM($H$5+SUM($D$6:D35)-SUM($E$6:E35)))","v":" "},null,null,null,6,"Ausblenden"]
[null,null,null,null,null,null,31,{"$f":"IF(D36+E36=0,\" \",SUM($H$5+SUM($D$6:D36)-SUM($E$6:E36)))","v":" "},null,null,null,6,"Ausblenden"]
[null,null,null,null,null,null,32,{"$f":"IF(D37+E37=0,\" \",SUM($H$5+SUM($D$6:D37)-SUM($E$6:E37)))","v":" "},null,null,null,6,"Ausblenden"]
[null,null,null,null,null,null,33,{"$f":"IF(D38+E38=0,\" \",SUM($H$5+SUM($D$6:D38)-SUM($E$6:E38)))","v":" "},null,null,null,6,"Ausblenden"]
[null,null,null,null,null,null,34,{"$f":"IF(D39+E39=0,\" \",SUM($H$5+SUM($D$6:D39)-SUM($E$6:E39)))","v":" "},null,null,null,6,"Ausblenden"]
[null,null,null,null,null,null,35,{"$f":"IF(D40+E40=0,\" \",SUM($H$5+SUM($D$6:D40)-SUM($E$6:E40)))","v":" "},null,null,null,6,"Ausblenden"]
[null,null,null,null,null,null,36,{"$f":"IF(D41+E41=0,\" \",SUM($H$5+SUM($D$6:D41)-SUM($E$6:E41)))","v":" "},null,null,null,6,"Ausblenden"]
[null,null,null,null,null,null,37,{"$f":"IF(D42+E42=0,\" \",SUM($H$5+SUM($D$6:D42)-SUM($E$6:E42)))","v":" "},null,null,null,6,"Ausblenden"]
[null,null,null,null,null,null,38,{"$f":"IF(D43+E43=0,\" \",SUM($H$5+SUM($D$6:D43)-SUM($E$6:E43)))","v":" "},null,null,null,6,"Ausblenden"]
[null,null,null,null,null,null,39,{"$f":"IF(D44+E44=0,\" \",SUM($H$5+SUM($D$6:D44)-SUM($E$6:E44)))","v":" "},null,null,null,6,"Ausblenden"]
[null,null,null,null,null,null,40,{"$f":"IF(D45+E45=0,\" \",SUM($H$5+SUM($D$6:D45)-SUM($E$6:E45)))","v":" "},null,null,null,6,"Ausblenden"]
[null,null,null,null,null,null,41,{"$f":"IF(D46+E46=0,\" \",SUM($H$5+SUM($D$6:D46)-SUM($E$6:E46)))","v":" "},null,null,null,6,"Ausblenden"]
[null,null,null,null,null,null,42,{"$f":"IF(D47+E47=0,\" \",SUM($H$5+SUM($D$6:D47)-SUM($E$6:E47)))","v":" "},null,null,null,6,"Ausblenden"]
[null,null,null,null,null,null,43,{"$f":"IF(D48+E48=0,\" \",SUM($H$5+SUM($D$6:D48)-SUM($E$6:E48)))","v":" "},null,null,null,6,"Ausblenden"]
[null,null,null,null,null,null,44,{"$f":"IF(D49+E49=0,\" \",SUM($H$5+SUM($D$6:D49)-SUM($E$6:E49)))","v":" "},null,null,null,6,"Ausblenden"]
[null,null,null,null,null,null,45,{"$f":"IF(D50+E50=0,\" \",SUM($H$5+SUM($D$6:D50)-SUM($E$6:E50)))","v":" "},null,null,null,6,"Ausblenden"]
[null,null,null,null,null,null,46,{"$f":"IF(D51+E51=0,\" \",SUM($H$5+SUM($D$6:D51)-SUM($E$6:E51)))","v":" "},null,null,null,6,"Ausblenden"]
[null,null,null,null,null,null,47,{"$f":"IF(D52+E52=0,\" \",SUM($H$5+SUM($D$6:D52)-SUM($E$6:E52)))","v":" "},null,null,null,6,"Ausblenden"]
[null,{"$f":"IF(SUM(D59:E105)<>0,\"Uebertrag\",\"Total\")","v":"Total"},null,{"$f":"SUM(D5:D52)","v":0},{"$f":"SUM(E5:E52)","v":0},null,null,{"$f":"H5+D53-E53","v":0},null,null,null,null,"Einblenden"]
[{"$f":"A1","v":"2023-09-06"},null,null,null,null,null,null,"Seite 2",null,null,null,null,{"$f":"IF(SUM($L$59:$L$105)<282,\"Einblenden\",\"Ausblenden\")","v":"Ausblenden"}]
[null,null,null,null,null,null,null,null,null,null,null,null,{"$f":"IF(SUM($L$59:$L$105)<282,\"Einblenden\",\"Ausblenden\")","v":"Ausblenden"}]
["Datum:","Text","FIBU","Einnahmen","Ausgaben",{"$f":"F3","v":"?"},null,"Saldo",null,null,null,null,{"$f":"IF(SUM($L$59:$L$105)<282,\"Einblenden\",\"Ausblenden\")","v":"Ausblenden"}]
[null,null,null,null,null,null,null,null,null,null,null,null,{"$f":"IF(SUM($L$59:$L$105)<282,\"Einblenden\",\"Ausblenden\")","v":"Ausblenden"}]
[null,"Uebertrag",null,{"$f":"D53","v":0},{"$f":"E53","v":0},null,null,{"$f":"H53","v":0},null,null,null,null,{"$f":"IF(SUM($L$59:$L$105)<282,\"Einblenden\",\"Ausblenden\")","v":"Ausblenden"}]
[null,null,null,null,null,null,48,{"$f":"IF(D59+E59=0,\" \",SUM($H$5+SUM($D$6:$D$52,$D$59:D59)-SUM($E$6:$E$52,$E$59:E59)))","v":" "},null,null,null,{"$f":"COUNTIF(A59:F59,\"\")","v":6},{"$f":"IF(L59<6,\"Einblenden\",\"Ausblenden\")","v":"Ausblenden"}]
[null,null,null,null,null,null,49,{"$f":"IF(D60+E60=0,\" \",SUM($H$5+SUM($D$6:$D$52,$D$59:D60)-SUM($E$6:$E$52,$E$59:E60)))","v":" "},null,null,null,{"$f":"COUNTIF(A60:F60,\"\")","v":6},{"$f":"IF(L60<6,\"Einblenden\",\"Ausblenden\")","v":"Ausblenden"}]
[null,null,null,null,null,null,50,{"$f":"IF(D61+E61=0,\" \",SUM($H$5+SUM($D$6:$D$52,$D$59:D61)-SUM($E$6:$E$52,$E$59:E61)))","v":" "},null,null,null,6,"Ausblenden"]
[null,null,null,null,null,null,51,{"$f":"IF(D62+E62=0,\" \",SUM($H$5+SUM($D$6:$D$52,$D$59:D62)-SUM($E$6:$E$52,$E$59:E62)))","v":" "},null,null,null,6,"Ausblenden"]
[null,null,null,null,null,null,52,{"$f":"IF(D63+E63=0,\" \",SUM($H$5+SUM($D$6:$D$52,$D$59:D63)-SUM($E$6:$E$52,$E$59:E63)))","v":" "},null,null,null,6,"Ausblenden"]
[null,null,null,null,null,null,53,{"$f":"IF(D64+E64=0,\" \",SUM($H$5+SUM($D$6:$D$52,$D$59:D64)-SUM($E$6:$E$52,$E$59:E64)))","v":" "},null,null,null,6,"Ausblenden"]
[null,null,null,null,null,null,54,{"$f":"IF(D65+E65=0,\" \",SUM($H$5+SUM($D$6:$D$52,$D$59:D65)-SUM($E$6:$E$52,$E$59:E65)))","v":" "},null,null,null,6,"Ausblenden"]
[null,null,null,null,null,null,55,{"$f":"IF(D66+E66=0,\" \",SUM($H$5+SUM($D$6:$D$52,$D$59:D66)-SUM($E$6:$E$52,$E$59:E66)))","v":" "},null,null,null,6,"Ausblenden"]
[null,null,null,null,null,null,56,{"$f":"IF(D67+E67=0,\" \",SUM($H$5+SUM($D$6:$D$52,$D$59:D67)-SUM($E$6:$E$52,$E$59:E67)))","v":" "},null,null,null,6,"Ausblenden"]
[null,null,null,null,null,null,57,{"$f":"IF(D68+E68=0,\" \",SUM($H$5+SUM($D$6:$D$52,$D$59:D68)-SUM($E$6:$E$52,$E$59:E68)))","v":" "},null,null,null,6,"Ausblenden"]
[null,null,null,null,null,null,58,{"$f":"IF(D69+E69=0,\" \",SUM($H$5+SUM($D$6:$D$52,$D$59:D69)-SUM($E$6:$E$52,$E$59:E69)))","v":" "},null,null,null,6,"Ausblenden"]
[null,null,null,null,null,null,59,{"$f":"IF(D70+E70=0,\" \",SUM($H$5+SUM($D$6:$D$52,$D$59:D70)-SUM($E$6:$E$52,$E$59:E70)))","v":" "},null,null,null,6,"Ausblenden"]
[null,null,null,null,null,null,60,{"$f":"IF(D71+E71=0,\" \",SUM($H$5+SUM($D$6:$D$52,$D$59:D71)-SUM($E$6:$E$52,$E$59:E71)))","v":" "},null,null,null,6,"Ausblenden"]
[null,null,null,null,null,null,61,{"$f":"IF(D72+E72=0,\" \",SUM($H$5+SUM($D$6:$D$52,$D$59:D72)-SUM($E$6:$E$52,$E$59:E72)))","v":" "},null,null,null,6,"Ausblenden"]
[null,null,null,null,null,null,62,{"$f":"IF(D73+E73=0,\" \",SUM($H$5+SUM($D$6:$D$52,$D$59:D73)-SUM($E$6:$E$52,$E$59:E73)))","v":" "},null,null,null,6,"Ausblenden"]
[null,null,null,null,null,null,63,{"$f":"IF(D74+E74=0,\" \",SUM($H$5+SUM($D$6:$D$52,$D$59:D74)-SUM($E$6:$E$52,$E$59:E74)))","v":" "},null,null,null,6,"Ausblenden"]
[null,null,null,null,null,null,64,{"$f":"IF(D75+E75=0,\" \",SUM($H$5+SUM($D$6:$D$52,$D$59:D75)-SUM($E$6:$E$52,$E$59:E75)))","v":" "},null,null,null,6,"Ausblenden"]
[null,null,null,null,null,null,65,{"$f":"IF(D76+E76=0,\" \",SUM($H$5+SUM($D$6:$D$52,$D$59:D76)-SUM($E$6:$E$52,$E$59:E76)))","v":" "},null,null,null,6,"Ausblenden"]
[null,null,null,null,null,null,66,{"$f":"IF(D77+E77=0,\" \",SUM($H$5+SUM($D$6:$D$52,$D$59:D77)-SUM($E$6:$E$52,$E$59:E77)))","v":" "},null,null,null,6,"Ausblenden"]
[null,null,null,null,null,null,67,{"$f":"IF(D78+E78=0,\" \",SUM($H$5+SUM($D$6:$D$52,$D$59:D78)-SUM($E$6:$E$52,$E$59:E78)))","v":" "},null,null,null,6,"Ausblenden"]
[null,null,null,null,null,null,68,{"$f":"IF(D79+E79=0,\" \",SUM($H$5+SUM($D$6:$D$52,$D$59:D79)-SUM($E$6:$E$52,$E$59:E79)))","v":" "},null,null,null,6,"Ausblenden"]
[null,null,null,null,null,null,69,{"$f":"IF(D80+E80=0,\" \",SUM($H$5+SUM($D$6:$D$52,$D$59:D80)-SUM($E$6:$E$52,$E$59:E80)))","v":" "},null,null,null,6,"Ausblenden"]
[null,null,null,null,null,null,70,{"$f":"IF(D81+E81=0,\" \",SUM($H$5+SUM($D$6:$D$52,$D$59:D81)-SUM($E$6:$E$52,$E$59:E81)))","v":" "},null,null,null,6,"Ausblenden"]
[null,null,null,null,null,null,71,{"$f":"IF(D82+E82=0,\" \",SUM($H$5+SUM($D$6:$D$52,$D$59:D82)-SUM($E$6:$E$52,$E$59:E82)))","v":" "},null,null,null,6,"Ausblenden"]
[null,null,null,null,null,null,72,{"$f":"IF(D83+E83=0,\" \",SUM($H$5+SUM($D$6:$D$52,$D$59:D83)-SUM($E$6:$E$52,$E$59:E83)))","v":" "},null,null,null,6,"Ausblenden"]
[null,null,null,null,null,null,73,{"$f":"IF(D84+E84=0,\" \",SUM($H$5+SUM($D$6:$D$52,$D$59:D84)-SUM($E$6:$E$52,$E$59:E84)))","v":" "},null,null,null,6,"Ausblenden"]
[null,null,null,null,null,null,74,{"$f":"IF(D85+E85=0,\" \",SUM($H$5+SUM($D$6:$D$52,$D$59:D85)-SUM($E$6:$E$52,$E$59:E85)))","v":" "},null,null,null,6,"Ausblenden"]
[null,null,null,null,null,null,75,{"$f":"IF(D86+E86=0,\" \",SUM($H$5+SUM($D$6:$D$52,$D$59:D86)-SUM($E$6:$E$52,$E$59:E86)))","v":" "},null,null,null,6,"Ausblenden"]
[null,null,null,null,null,null,76,{"$f":"IF(D87+E87=0,\" \",SUM($H$5+SUM($D$6:$D$52,$D$59:D87)-SUM($E$6:$E$52,$E$59:E87)))","v":" "},null,null,null,6,"Ausblenden"]
[null,null,null,null,null,null,77,{"$f":"IF(D88+E88=0,\" \",SUM($H$5+SUM($D$6:$D$52,$D$59:D88)-SUM($E$6:$E$52,$E$59:E88)))","v":" "},null,null,null,6,"Ausblenden"]
[null,null,null,null,null,null,78,{"$f":"IF(D89+E89=0,\" \",SUM($H$5+SUM($D$6:$D$52,$D$59:D89)-SUM($E$6:$E$52,$E$59:E89)))","v":" "},null,null,null,6,"Ausblenden"]
[null,null,null,null,null,null,79,{"$f":"IF(D90+E90=0,\" \",SUM($H$5+SUM($D$6:$D$52,$D$59:D90)-SUM($E$6:$E$52,$E$59:E90)))","v":" "},null,null,null,6,"Ausblenden"]
[null,null,null,null,null,null,80,{"$f":"IF(D91+E91=0,\" \",SUM($H$5+SUM($D$6:$D$52,$D$59:D91)-SUM($E$6:$E$52,$E$59:E91)))","v":" "},null,null,null,6,"Ausblenden"]
[null,null,null,null,null,null,81,{"$f":"IF(D92+E92=0,\" \",SUM($H$5+SUM($D$6:$D$52,$D$59:D92)-SUM($E$6:$E$52,$E$59:E92)))","v":" "},null,null,null,6,"Ausblenden"]
[null,null,null,null,null,null,82,{"$f":"IF(D93+E93=0,\" \",SUM($H$5+SUM($D$6:$D$52,$D$59:D93)-SUM($E$6:$E$52,$E$59:E93)))","v":" "},null,null,null,6,"Ausblenden"]
[null,null,null,null,null,null,83,{"$f":"IF(D94+E94=0,\" \",SUM($H$5+SUM($D$6:$D$52,$D$59:D94)-SUM($E$6:$E$52,$E$59:E94)))","v":" "},null,null,null,6,"Ausblenden"]
[null,null,null,null,null,null,84,{"$f":"IF(D95+E95=0,\" \",SUM($H$5+SUM($D$6:$D$52,$D$59:D95)-SUM($E$6:$E$52,$E$59:E95)))","v":" "},null,null,null,6,"Ausblenden"]
[null,null,null,null,null,null,85,{"$f":"IF(D96+E96=0,\" \",SUM($H$5+SUM($D$6:$D$52,$D$59:D96)-SUM($E$6:$E$52,$E$59:E96)))","v":" "},null,null,null,6,"Ausblenden"]
[null,null,null,null,null,null,86,{"$f":"IF(D97+E97=0,\" \",SUM($H$5+SUM($D$6:$D$52,$D$59:D97)-SUM($E$6:$E$52,$E$59:E97)))","v":" "},null,null,null,6,"Ausblenden"]
[null,null,null,null,null,null,87,{"$f":"IF(D98+E98=0,\" \",SUM($H$5+SUM($D$6:$D$52,$D$59:D98)-SUM($E$6:$E$52,$E$59:E98)))","v":" "},null,null,null,6,"Ausblenden"]
[null,null,null,null,null,null,88,{"$f":"IF(D99+E99=0,\" \",SUM($H$5+SUM($D$6:$D$52,$D$59:D99)-SUM($E$6:$E$52,$E$59:E99)))","v":" "},null,null,null,6,"Ausblenden"]
[null,null,null,null,null,null,89,{"$f":"IF(D100+E100=0,\" \",SUM($H$5+SUM($D$6:$D$52,$D$59:D100)-SUM($E$6:$E$52,$E$59:E100)))","v":" "},null,null,null,6,"Ausblenden"]
[null,null,null,null,null,null,90,{"$f":"IF(D101+E101=0,\" \",SUM($H$5+SUM($D$6:$D$52,$D$59:D101)-SUM($E$6:$E$52,$E$59:E101)))","v":" "},null,null,null,6,"Ausblenden"]
[null,null,null,null,null,null,91,{"$f":"IF(D102+E102=0,\" \",SUM($H$5+SUM($D$6:$D$52,$D$59:D102)-SUM($E$6:$E$52,$E$59:E102)))","v":" "},null,null,null,6,"Ausblenden"]
[null,null,null,null,null,null,92,{"$f":"IF(D103+E103=0,\" \",SUM($H$5+SUM($D$6:$D$52,$D$59:D103)-SUM($E$6:$E$52,$E$59:E103)))","v":" "},null,null,null,6,"Ausblenden"]
[null,null,null,null,null,null,93,{"$f":"IF(D104+E104=0,\" \",SUM($H$5+SUM($D$6:$D$52,$D$59:D104)-SUM($E$6:$E$52,$E$59:E104)))","v":" "},null,null,null,6,"Ausblenden"]
[null,null,null,null,null,null,94,{"$f":"IF(D105+E105=0,\" \",SUM($H$5+SUM($D$6:$D$52,$D$59:D105)-SUM($E$6:$E$52,$E$59:E105)))","v":" "},null,null,null,{"$f":"COUNTIF(A105:F105,\"\")","v":6},"Ausblenden"]
[null,{"$f":"IF(SUM(D112:E158)<>0,\"Uebertrag\",\"Total\")","v":"Total"},null,{"$f":"SUM(D58:D105)","v":0},{"$f":"SUM(E58:E105)","v":0},null,null,{"$f":"$H$5+D106-E106","v":0},null,null,null,null,{"$f":"IF(SUM($L$59:$L$105)<282,\"Einblenden\",\"Ausblenden\")","v":"Ausblenden"}]
[{"$f":"A1","v":"2023-09-06"},null,null,null,null,null,null,"Seite 3",null,null,null,null,{"$f":"IF(SUM($L$112:$L$158)<282,\"Einblenden\",\"Ausblenden\")","v":"Ausblenden"}]
[null,null,null,null,null,null,null,null,null,null,null,null,{"$f":"IF(SUM($L$112:$L$158)<282,\"Einblenden\",\"Ausblenden\")","v":"Ausblenden"}]
["Datum:","Text","FIBU","Einnahmen","Ausgaben",{"$f":"F3","v":"?"},null,"Saldo",null,null,null,null,{"$f":"IF(SUM($L$112:$L$158)<282,\"Einblenden\",\"Ausblenden\")","v":"Ausblenden"}]
[null,null,null,null,null,null,null,null,null,null,null,null,{"$f":"IF(SUM($L$112:$L$158)<282,\"Einblenden\",\"Ausblenden\")","v":"Ausblenden"}]
[null,"Uebertrag",null,{"$f":"D106","v":0},{"$f":"E106","v":0},null,null,{"$f":"H106","v":0},null,null,null,null,{"$f":"IF(SUM($L$112:$L$158)<282,\"Einblenden\",\"Ausblenden\")","v":"Ausblenden"}]
[null,null,null,null,null,null,95,{"$f":"IF(D112+E112=0,\" \",SUM($H$5+SUM($D$6:$D$52,$D$59:$D$105,$D$112:D112)-SUM($E$6:$E$52,$E$59:$E$105,$E$112:E112)))","v":" "},null,null,null,{"$f":"COUNTIF(A112:F112,\"\")","v":6},{"$f":"IF(L112<6,\"Einblenden\",\"Ausblenden\")","v":"Ausblenden"}]
[null,null,null,null,null,null,96,{"$f":"IF(D113+E113=0,\" \",SUM($H$5+SUM($D$6:$D$52,$D$59:$D$105,$D$112:D113)-SUM($E$6:$E$52,$E$59:$E$105,$E$112:E113)))","v":" "},null,null,null,{"$f":"COUNTIF(A113:F113,\"\")","v":6},"Ausblenden"]
[null,null,null,null,null,null,97,{"$f":"IF(D114+E114=0,\" \",SUM($H$5+SUM($D$6:$D$52,$D$59:$D$105,$D$112:D114)-SUM($E$6:$E$52,$E$59:$E$105,$E$112:E114)))","v":" "},null,null,null,6,"Ausblenden"]
[null,null,null,null,null,null,98,{"$f":"IF(D115+E115=0,\" \",SUM($H$5+SUM($D$6:$D$52,$D$59:$D$105,$D$112:D115)-SUM($E$6:$E$52,$E$59:$E$105,$E$112:E115)))","v":" "},null,null,null,6,"Ausblenden"]
[null,null,null,null,null,null,99,{"$f":"IF(D116+E116=0,\" \",SUM($H$5+SUM($D$6:$D$52,$D$59:$D$105,$D$112:D116)-SUM($E$6:$E$52,$E$59:$E$105,$E$112:E116)))","v":" "},null,null,null,6,"Ausblenden"]
[null,null,null,null,null,null,100,{"$f":"IF(D117+E117=0,\" \",SUM($H$5+SUM($D$6:$D$52,$D$59:$D$105,$D$112:D117)-SUM($E$6:$E$52,$E$59:$E$105,$E$112:E117)))","v":" "},null,null,null,6,"Ausblenden"]
[null,null,null,null,null,null,101,{"$f":"IF(D118+E118=0,\" \",SUM($H$5+SUM($D$6:$D$52,$D$59:$D$105,$D$112:D118)-SUM($E$6:$E$52,$E$59:$E$105,$E$112:E118)))","v":" "},null,null,null,6,"Ausblenden"]
[null,null,null,null,null,null,102,{"$f":"IF(D119+E119=0,\" \",SUM($H$5+SUM($D$6:$D$52,$D$59:$D$105,$D$112:D119)-SUM($E$6:$E$52,$E$59:$E$105,$E$112:E119)))","v":" "},null,null,null,6,"Ausblenden"]
[null,null,null,null,null,null,103,{"$f":"IF(D120+E120=0,\" \",SUM($H$5+SUM($D$6:$D$52,$D$59:$D$105,$D$112:D120)-SUM($E$6:$E$52,$E$59:$E$105,$E$112:E120)))","v":" "},null,null,null,6,"Ausblenden"]
[null,null,null,null,null,null,104,{"$f":"IF(D121+E121=0,\" \",SUM($H$5+SUM($D$6:$D$52,$D$59:$D$105,$D$112:D121)-SUM($E$6:$E$52,$E$59:$E$105,$E$112:E121)))","v":" "},null,null,null,6,"Ausblenden"]
[null,null,null,null,null,null,105,{"$f":"IF(D122+E122=0,\" \",SUM($H$5+SUM($D$6:$D$52,$D$59:$D$105,$D$112:D122)-SUM($E$6:$E$52,$E$59:$E$105,$E$112:E122)))","v":" "},null,null,null,6,"Ausblenden"]
[null,null,null,null,null,null,106,{"$f":"IF(D123+E123=0,\" \",SUM($H$5+SUM($D$6:$D$52,$D$59:$D$105,$D$112:D123)-SUM($E$6:$E$52,$E$59:$E$105,$E$112:E123)))","v":" "},null,null,null,6,"Ausblenden"]
[null,null,null,null,null,null,107,{"$f":"IF(D124+E124=0,\" \",SUM($H$5+SUM($D$6:$D$52,$D$59:$D$105,$D$112:D124)-SUM($E$6:$E$52,$E$59:$E$105,$E$112:E124)))","v":" "},null,null,null,6,"Ausblenden"]
[null,null,null,null,null,null,108,{"$f":"IF(D125+E125=0,\" \",SUM($H$5+SUM($D$6:$D$52,$D$59:$D$105,$D$112:D125)-SUM($E$6:$E$52,$E$59:$E$105,$E$112:E125)))","v":" "},null,null,null,6,"Ausblenden"]
[null,null,null,null,null,null,109,{"$f":"IF(D126+E126=0,\" \",SUM($H$5+SUM($D$6:$D$52,$D$59:$D$105,$D$112:D126)-SUM($E$6:$E$52,$E$59:$E$105,$E$112:E126)))","v":" "},null,null,null,6,"Ausblenden"]
[null,null,null,null,null,null,110,{"$f":"IF(D127+E127=0,\" \",SUM($H$5+SUM($D$6:$D$52,$D$59:$D$105,$D$112:D127)-SUM($E$6:$E$52,$E$59:$E$105,$E$112:E127)))","v":" "},null,null,null,6,"Ausblenden"]
[null,null,null,null,null,null,111,{"$f":"IF(D128+E128=0,\" \",SUM($H$5+SUM($D$6:$D$52,$D$59:$D$105,$D$112:D128)-SUM($E$6:$E$52,$E$59:$E$105,$E$112:E128)))","v":" "},null,null,null,6,"Ausblenden"]
[null,null,null,null,null,null,112,{"$f":"IF(D129+E129=0,\" \",SUM($H$5+SUM($D$6:$D$52,$D$59:$D$105,$D$112:D129)-SUM($E$6:$E$52,$E$59:$E$105,$E$112:E129)))","v":" "},null,null,null,6,"Ausblenden"]
[null,null,null,null,null,null,113,{"$f":"IF(D130+E130=0,\" \",SUM($H$5+SUM($D$6:$D$52,$D$59:$D$105,$D$112:D130)-SUM($E$6:$E$52,$E$59:$E$105,$E$112:E130)))","v":" "},null,null,null,6,"Ausblenden"]
[null,null,null,null,null,null,114,{"$f":"IF(D131+E131=0,\" \",SUM($H$5+SUM($D$6:$D$52,$D$59:$D$105,$D$112:D131)-SUM($E$6:$E$52,$E$59:$E$105,$E$112:E131)))","v":" "},null,null,null,6,"Ausblenden"]
[null,null,null,null,null,null,115,{"$f":"IF(D132+E132=0,\" \",SUM($H$5+SUM($D$6:$D$52,$D$59:$D$105,$D$112:D132)-SUM($E$6:$E$52,$E$59:$E$105,$E$112:E132)))","v":" "},null,null,null,6,"Ausblenden"]
[null,null,null,null,null,null,116,{"$f":"IF(D133+E133=0,\" \",SUM($H$5+SUM($D$6:$D$52,$D$59:$D$105,$D$112:D133)-SUM($E$6:$E$52,$E$59:$E$105,$E$112:E133)))","v":" "},null,null,null,6,"Ausblenden"]
[null,null,null,null,null,null,117,{"$f":"IF(D134+E134=0,\" \",SUM($H$5+SUM($D$6:$D$52,$D$59:$D$105,$D$112:D134)-SUM($E$6:$E$52,$E$59:$E$105,$E$112:E134)))","v":" "},null,null,null,6,"Ausblenden"]
[null,null,null,null,null,null,118,{"$f":"IF(D135+E135=0,\" \",SUM($H$5+SUM($D$6:$D$52,$D$59:$D$105,$D$112:D135)-SUM($E$6:$E$52,$E$59:$E$105,$E$112:E135)))","v":" "},null,null,null,6,"Ausblenden"]
[null,null,null,null,null,null,119,{"$f":"IF(D136+E136=0,\" \",SUM($H$5+SUM($D$6:$D$52,$D$59:$D$105,$D$112:D136)-SUM($E$6:$E$52,$E$59:$E$105,$E$112:E136)))","v":" "},null,null,null,6,"Ausblenden"]
[null,null,null,null,null,null,120,{"$f":"IF(D137+E137=0,\" \",SUM($H$5+SUM($D$6:$D$52,$D$59:$D$105,$D$112:D137)-SUM($E$6:$E$52,$E$59:$E$105,$E$112:E137)))","v":" "},null,null,null,6,"Ausblenden"]
[null,null,null,null,null,null,121,{"$f":"IF(D138+E138=0,\" \",SUM($H$5+SUM($D$6:$D$52,$D$59:$D$105,$D$112:D138)-SUM($E$6:$E$52,$E$59:$E$105,$E$112:E138)))","v":" "},null,null,null,6,"Ausblenden"]
[null,null,null,null,null,null,122,{"$f":"IF(D139+E139=0,\" \",SUM($H$5+SUM($D$6:$D$52,$D$59:$D$105,$D$112:D139)-SUM($E$6:$E$52,$E$59:$E$105,$E$112:E139)))","v":" "},null,null,null,6,"Ausblenden"]
[null,null,null,null,null,null,123,{"$f":"IF(D140+E140=0,\" \",SUM($H$5+SUM($D$6:$D$52,$D$59:$D$105,$D$112:D140)-SUM($E$6:$E$52,$E$59:$E$105,$E$112:E140)))","v":" "},null,null,null,6,"Ausblenden"]
[null,null,null,null,null,null,124,{"$f":"IF(D141+E141=0,\" \",SUM($H$5+SUM($D$6:$D$52,$D$59:$D$105,$D$112:D141)-SUM($E$6:$E$52,$E$59:$E$105,$E$112:E141)))","v":" "},null,null,null,6,"Ausblenden"]
[null,null,null,null,null,null,125,{"$f":"IF(D142+E142=0,\" \",SUM($H$5+SUM($D$6:$D$52,$D$59:$D$105,$D$112:D142)-SUM($E$6:$E$52,$E$59:$E$105,$E$112:E142)))","v":" "},null,null,null,6,"Ausblenden"]
[null,null,null,null,null,null,126,{"$f":"IF(D143+E143=0,\" \",SUM($H$5+SUM($D$6:$D$52,$D$59:$D$105,$D$112:D143)-SUM($E$6:$E$52,$E$59:$E$105,$E$112:E143)))","v":" "},null,null,null,6,"Ausblenden"]
[null,null,null,null,null,null,127,{"$f":"IF(D144+E144=0,\" \",SUM($H$5+SUM($D$6:$D$52,$D$59:$D$105,$D$112:D144)-SUM($E$6:$E$52,$E$59:$E$105,$E$112:E144)))","v":" "},null,null,null,6,"Ausblenden"]
[null,null,null,null,null,null,128,{"$f":"IF(D145+E145=0,\" \",SUM($H$5+SUM($D$6:$D$52,$D$59:$D$105,$D$112:D145)-SUM($E$6:$E$52,$E$59:$E$105,$E$112:E145)))","v":" "},null,null,null,6,"Ausblenden"]
[null,null,null,null,null,null,129,{"$f":"IF(D146+E146=0,\" \",SUM($H$5+SUM($D$6:$D$52,$D$59:$D$105,$D$112:D146)-SUM($E$6:$E$52,$E$59:$E$105,$E$112:E146)))","v":" "},null,null,null,6,"Ausblenden"]
[null,null,null,null,null,null,130,{"$f":"IF(D147+E147=0,\" \",SUM($H$5+SUM($D$6:$D$52,$D$59:$D$105,$D$112:D147)-SUM($E$6:$E$52,$E$59:$E$105,$E$112:E147)))","v":" "},null,null,null,6,"Ausblenden"]
[null,null,null,null,null,null,131,{"$f":"IF(D148+E148=0,\" \",SUM($H$5+SUM($D$6:$D$52,$D$59:$D$105,$D$112:D148)-SUM($E$6:$E$52,$E$59:$E$105,$E$112:E148)))","v":" "},null,null,null,6,"Ausblenden"]
[null,null,null,null,null,null,132,{"$f":"IF(D149+E149=0,\" \",SUM($H$5+SUM($D$6:$D$52,$D$59:$D$105,$D$112:D149)-SUM($E$6:$E$52,$E$59:$E$105,$E$112:E149)))","v":" "},null,null,null,6,"Ausblenden"]
[null,null,null,null,null,null,133,{"$f":"IF(D150+E150=0,\" \",SUM($H$5+SUM($D$6:$D$52,$D$59:$D$105,$D$112:D150)-SUM($E$6:$E$52,$E$59:$E$105,$E$112:E150)))","v":" "},null,null,null,6,"Ausblenden"]
[null,null,null,null,null,null,134,{"$f":"IF(D151+E151=0,\" \",SUM($H$5+SUM($D$6:$D$52,$D$59:$D$105,$D$112:D151)-SUM($E$6:$E$52,$E$59:$E$105,$E$112:E151)))","v":" "},null,null,null,6,"Ausblenden"]
[null,null,null,null,null,null,135,{"$f":"IF(D152+E152=0,\" \",SUM($H$5+SUM($D$6:$D$52,$D$59:$D$105,$D$112:D152)-SUM($E$6:$E$52,$E$59:$E$105,$E$112:E152)))","v":" "},null,null,null,6,"Ausblenden"]
[null,null,null,null,null,null,136,{"$f":"IF(D153+E153=0,\" \",SUM($H$5+SUM($D$6:$D$52,$D$59:$D$105,$D$112:D153)-SUM($E$6:$E$52,$E$59:$E$105,$E$112:E153)))","v":" "},null,null,null,6,"Ausblenden"]
[null,null,null,null,null,null,137,{"$f":"IF(D154+E154=0,\" \",SUM($H$5+SUM($D$6:$D$52,$D$59:$D$105,$D$112:D154)-SUM($E$6:$E$52,$E$59:$E$105,$E$112:E154)))","v":" "},null,null,null,6,"Ausblenden"]
[null,null,null,null,null,null,138,{"$f":"IF(D155+E155=0,\" \",SUM($H$5+SUM($D$6:$D$52,$D$59:$D$105,$D$112:D155)-SUM($E$6:$E$52,$E$59:$E$105,$E$112:E155)))","v":" "},null,null,null,6,"Ausblenden"]
[null,null,null,null,null,null,139,{"$f":"IF(D156+E156=0,\" \",SUM($H$5+SUM($D$6:$D$52,$D$59:$D$105,$D$112:D156)-SUM($E$6:$E$52,$E$59:$E$105,$E$112:E156)))","v":" "},null,null,null,6,"Ausblenden"]
[null,null,null,null,null,null,140,{"$f":"IF(D157+E157=0,\" \",SUM($H$5+SUM($D$6:$D$52,$D$59:$D$105,$D$112:D157)-SUM($E$6:$E$52,$E$59:$E$105,$E$112:E157)))","v":" "},null,null,null,6,"Ausblenden"]
[null,null,null,null,null,null,141,{"$f":"IF(D158+E158=0,\" \",SUM($H$5+SUM($D$6:$D$52,$D$59:$D$105,$D$112:D158)-SUM($E$6:$E$52,$E$59:$E$105,$E$112:E158)))","v":" "},null,null,null,6,"Ausblenden"]
[null,"Total",null,{"$f":"SUM(D111:D158)","v":0},{"$f":"SUM(E111:E158)","v":0},null,null,{"$f":"$H$5+D159-E159","v":0},null,null,null,null,{"$f":"IF(SUM($L$112:$L$158)<282,\"Einblenden\",\"Ausblenden\")","v":"Ausblenden"}]

{"sheet":"Oktober","index":10,"n_rows":159,"n_cols":13,"rows_kept":159,"cut":false,"hidden":false,"merged":[]}
[{"$f":"September!A1+31","v":"2023-10-07"}]
[]
["Datum:","Text","FIBU","Einnahmen","Ausgaben",{"$f":"Januar!F3","v":"?"},null,"Saldo"]
[]
[1,"Saldovortrag",null,null,null,null,null,{"$f":"SUM(September!H159)","v":0}]
[null,null,null,null,null,null,1,{"$f":"IF(D6+E6=0,\" \",SUM($H$5+SUM($D$6:D6)-SUM($E$6:E6)))","v":" "},null,null,null,null,"Einblenden"]
[null,null,null,null,null,null,2,{"$f":"IF(D7+E7=0,\" \",SUM($H$5+SUM($D$6:D7)-SUM($E$6:E7)))","v":" "},null,null,null,{"$f":"COUNTIF(A7:F7,\"\")","v":6},{"$f":"IF(L7<6,\"Einblenden\",\"Ausblenden\")","v":"Ausblenden"}]
[null,null,null,null,null,null,3,{"$f":"IF(D8+E8=0,\" \",SUM($H$5+SUM($D$6:D8)-SUM($E$6:E8)))","v":" "},null,null,null,{"$f":"COUNTIF(A8:F8,\"\")","v":6},{"$f":"IF(L8<6,\"Einblenden\",\"Ausblenden\")","v":"Ausblenden"}]
[null,null,null,null,null,null,4,{"$f":"IF(D9+E9=0,\" \",SUM($H$5+SUM($D$6:D9)-SUM($E$6:E9)))","v":" "},null,null,null,6,"Ausblenden"]
[null,null,null,null,null,null,5,{"$f":"IF(D10+E10=0,\" \",SUM($H$5+SUM($D$6:D10)-SUM($E$6:E10)))","v":" "},null,null,null,6,"Ausblenden"]
[null,null,null,null,null,null,6,{"$f":"IF(D11+E11=0,\" \",SUM($H$5+SUM($D$6:D11)-SUM($E$6:E11)))","v":" "},null,null,null,6,"Ausblenden"]
[null,null,null,null,null,null,7,{"$f":"IF(D12+E12=0,\" \",SUM($H$5+SUM($D$6:D12)-SUM($E$6:E12)))","v":" "},null,null,null,6,"Ausblenden"]
[null,null,null,null,null,null,8,{"$f":"IF(D13+E13=0,\" \",SUM($H$5+SUM($D$6:D13)-SUM($E$6:E13)))","v":" "},null,null,null,6,"Ausblenden"]
[null,null,null,null,null,null,9,{"$f":"IF(D14+E14=0,\" \",SUM($H$5+SUM($D$6:D14)-SUM($E$6:E14)))","v":" "},null,null,null,6,"Ausblenden"]
[null,null,null,null,null,null,10,{"$f":"IF(D15+E15=0,\" \",SUM($H$5+SUM($D$6:D15)-SUM($E$6:E15)))","v":" "},null,null,null,6,"Ausblenden"]
[null,null,null,null,null,null,11,{"$f":"IF(D16+E16=0,\" \",SUM($H$5+SUM($D$6:D16)-SUM($E$6:E16)))","v":" "},null,null,null,6,"Ausblenden"]
[null,null,null,null,null,null,12,{"$f":"IF(D17+E17=0,\" \",SUM($H$5+SUM($D$6:D17)-SUM($E$6:E17)))","v":" "},null,null,null,6,"Ausblenden"]
[null,null,null,null,null,null,13,{"$f":"IF(D18+E18=0,\" \",SUM($H$5+SUM($D$6:D18)-SUM($E$6:E18)))","v":" "},null,null,null,6,"Ausblenden"]
[null,null,null,null,null,null,14,{"$f":"IF(D19+E19=0,\" \",SUM($H$5+SUM($D$6:D19)-SUM($E$6:E19)))","v":" "},null,null,null,6,"Ausblenden"]
[null,null,null,null,null,null,15,{"$f":"IF(D20+E20=0,\" \",SUM($H$5+SUM($D$6:D20)-SUM($E$6:E20)))","v":" "},null,null,null,6,"Ausblenden"]
[null,null,null,null,null,null,16,{"$f":"IF(D21+E21=0,\" \",SUM($H$5+SUM($D$6:D21)-SUM($E$6:E21)))","v":" "},null,null,null,6,"Ausblenden"]
[null,null,null,null,null,null,17,{"$f":"IF(D22+E22=0,\" \",SUM($H$5+SUM($D$6:D22)-SUM($E$6:E22)))","v":" "},null,null,null,6,"Ausblenden"]
[null,null,null,null,null,null,18,{"$f":"IF(D23+E23=0,\" \",SUM($H$5+SUM($D$6:D23)-SUM($E$6:E23)))","v":" "},null,null,null,6,"Ausblenden"]
[null,null,null,null,null,null,19,{"$f":"IF(D24+E24=0,\" \",SUM($H$5+SUM($D$6:D24)-SUM($E$6:E24)))","v":" "},null,null,null,6,"Ausblenden"]
[null,null,null,null,null,null,20,{"$f":"IF(D25+E25=0,\" \",SUM($H$5+SUM($D$6:D25)-SUM($E$6:E25)))","v":" "},null,null,null,6,"Ausblenden"]
[null,null,null,null,null,null,21,{"$f":"IF(D26+E26=0,\" \",SUM($H$5+SUM($D$6:D26)-SUM($E$6:E26)))","v":" "},null,null,null,6,"Ausblenden"]
[null,null,null,null,null,null,22,{"$f":"IF(D27+E27=0,\" \",SUM($H$5+SUM($D$6:D27)-SUM($E$6:E27)))","v":" "},null,null,null,6,"Ausblenden"]
[null,null,null,null,null,null,23,{"$f":"IF(D28+E28=0,\" \",SUM($H$5+SUM($D$6:D28)-SUM($E$6:E28)))","v":" "},null,null,null,6,"Ausblenden"]
[null,null,null,null,null,null,24,{"$f":"IF(D29+E29=0,\" \",SUM($H$5+SUM($D$6:D29)-SUM($E$6:E29)))","v":" "},null,null,null,6,"Ausblenden"]
[null,null,null,null,null,null,25,{"$f":"IF(D30+E30=0,\" \",SUM($H$5+SUM($D$6:D30)-SUM($E$6:E30)))","v":" "},null,null,null,6,"Ausblenden"]
[null,null,null,null,null,null,26,{"$f":"IF(D31+E31=0,\" \",SUM($H$5+SUM($D$6:D31)-SUM($E$6:E31)))","v":" "},null,null,null,6,"Ausblenden"]
[null,null,null,null,null,null,27,{"$f":"IF(D32+E32=0,\" \",SUM($H$5+SUM($D$6:D32)-SUM($E$6:E32)))","v":" "},null,null,null,6,"Ausblenden"]
[null,null,null,null,null,null,28,{"$f":"IF(D33+E33=0,\" \",SUM($H$5+SUM($D$6:D33)-SUM($E$6:E33)))","v":" "},null,null,null,6,"Ausblenden"]
[null,null,null,null,null,null,29,{"$f":"IF(D34+E34=0,\" \",SUM($H$5+SUM($D$6:D34)-SUM($E$6:E34)))","v":" "},null,null,null,6,"Ausblenden"]
[null,null,null,null,null,null,30,{"$f":"IF(D35+E35=0,\" \",SUM($H$5+SUM($D$6:D35)-SUM($E$6:E35)))","v":" "},null,null,null,6,"Ausblenden"]
[null,null,null,null,null,null,31,{"$f":"IF(D36+E36=0,\" \",SUM($H$5+SUM($D$6:D36)-SUM($E$6:E36)))","v":" "},null,null,null,6,"Ausblenden"]
[null,null,null,null,null,null,32,{"$f":"IF(D37+E37=0,\" \",SUM($H$5+SUM($D$6:D37)-SUM($E$6:E37)))","v":" "},null,null,null,6,"Ausblenden"]
[null,null,null,null,null,null,33,{"$f":"IF(D38+E38=0,\" \",SUM($H$5+SUM($D$6:D38)-SUM($E$6:E38)))","v":" "},null,null,null,6,"Ausblenden"]
[null,null,null,null,null,null,34,{"$f":"IF(D39+E39=0,\" \",SUM($H$5+SUM($D$6:D39)-SUM($E$6:E39)))","v":" "},null,null,null,6,"Ausblenden"]
[null,null,null,null,null,null,35,{"$f":"IF(D40+E40=0,\" \",SUM($H$5+SUM($D$6:D40)-SUM($E$6:E40)))","v":" "},null,null,null,6,"Ausblenden"]
[null,null,null,null,null,null,36,{"$f":"IF(D41+E41=0,\" \",SUM($H$5+SUM($D$6:D41)-SUM($E$6:E41)))","v":" "},null,null,null,6,"Ausblenden"]
[null,null,null,null,null,null,37,{"$f":"IF(D42+E42=0,\" \",SUM($H$5+SUM($D$6:D42)-SUM($E$6:E42)))","v":" "},null,null,null,6,"Ausblenden"]
[null,null,null,null,null,null,38,{"$f":"IF(D43+E43=0,\" \",SUM($H$5+SUM($D$6:D43)-SUM($E$6:E43)))","v":" "},null,null,null,6,"Ausblenden"]
[null,null,null,null,null,null,39,{"$f":"IF(D44+E44=0,\" \",SUM($H$5+SUM($D$6:D44)-SUM($E$6:E44)))","v":" "},null,null,null,6,"Ausblenden"]
[null,null,null,null,null,null,40,{"$f":"IF(D45+E45=0,\" \",SUM($H$5+SUM($D$6:D45)-SUM($E$6:E45)))","v":" "},null,null,null,6,"Ausblenden"]
[null,null,null,null,null,null,41,{"$f":"IF(D46+E46=0,\" \",SUM($H$5+SUM($D$6:D46)-SUM($E$6:E46)))","v":" "},null,null,null,6,"Ausblenden"]
[null,null,null,null,null,null,42,{"$f":"IF(D47+E47=0,\" \",SUM($H$5+SUM($D$6:D47)-SUM($E$6:E47)))","v":" "},null,null,null,6,"Ausblenden"]
[null,null,null,null,null,null,43,{"$f":"IF(D48+E48=0,\" \",SUM($H$5+SUM($D$6:D48)-SUM($E$6:E48)))","v":" "},null,null,null,6,"Ausblenden"]
[null,null,null,null,null,null,44,{"$f":"IF(D49+E49=0,\" \",SUM($H$5+SUM($D$6:D49)-SUM($E$6:E49)))","v":" "},null,null,null,6,"Ausblenden"]
[null,null,null,null,null,null,45,{"$f":"IF(D50+E50=0,\" \",SUM($H$5+SUM($D$6:D50)-SUM($E$6:E50)))","v":" "},null,null,null,6,"Ausblenden"]
[null,null,null,null,null,null,46,{"$f":"IF(D51+E51=0,\" \",SUM($H$5+SUM($D$6:D51)-SUM($E$6:E51)))","v":" "},null,null,null,6,"Ausblenden"]
[null,null,null,null,null,null,47,{"$f":"IF(D52+E52=0,\" \",SUM($H$5+SUM($D$6:D52)-SUM($E$6:E52)))","v":" "},null,null,null,6,"Ausblenden"]
[null,{"$f":"IF(SUM(D59:E105)<>0,\"Uebertrag\",\"Total\")","v":"Total"},null,{"$f":"SUM(D5:D52)","v":0},{"$f":"SUM(E5:E52)","v":0},null,null,{"$f":"H5+D53-E53","v":0},null,null,null,null,"Einblenden"]
[{"$f":"A1","v":"2023-10-07"},null,null,null,null,null,null,"Seite 2",null,null,null,null,{"$f":"IF(SUM($L$59:$L$105)<282,\"Einblenden\",\"Ausblenden\")","v":"Ausblenden"}]
[null,null,null,null,null,null,null,null,null,null,null,null,{"$f":"IF(SUM($L$59:$L$105)<282,\"Einblenden\",\"Ausblenden\")","v":"Ausblenden"}]
["Datum:","Text","FIBU","Einnahmen","Ausgaben",{"$f":"F3","v":"?"},null,"Saldo",null,null,null,null,{"$f":"IF(SUM($L$59:$L$105)<282,\"Einblenden\",\"Ausblenden\")","v":"Ausblenden"}]
[null,null,null,null,null,null,null,null,null,null,null,null,{"$f":"IF(SUM($L$59:$L$105)<282,\"Einblenden\",\"Ausblenden\")","v":"Ausblenden"}]
[null,"Uebertrag",null,{"$f":"D53","v":0},{"$f":"E53","v":0},null,null,{"$f":"H53","v":0},null,null,null,null,{"$f":"IF(SUM($L$59:$L$105)<282,\"Einblenden\",\"Ausblenden\")","v":"Ausblenden"}]
[null,null,null,null,null,null,48,{"$f":"IF(D59+E59=0,\" \",SUM($H$5+SUM($D$6:$D$52,$D$59:D59)-SUM($E$6:$E$52,$E$59:E59)))","v":" "},null,null,null,{"$f":"COUNTIF(A59:F59,\"\")","v":6},{"$f":"IF(L59<6,\"Einblenden\",\"Ausblenden\")","v":"Ausblenden"}]
[null,null,null,null,null,null,49,{"$f":"IF(D60+E60=0,\" \",SUM($H$5+SUM($D$6:$D$52,$D$59:D60)-SUM($E$6:$E$52,$E$59:E60)))","v":" "},null,null,null,{"$f":"COUNTIF(A60:F60,\"\")","v":6},{"$f":"IF(L60<6,\"Einblenden\",\"Ausblenden\")","v":"Ausblenden"}]
[null,null,null,null,null,null,50,{"$f":"IF(D61+E61=0,\" \",SUM($H$5+SUM($D$6:$D$52,$D$59:D61)-SUM($E$6:$E$52,$E$59:E61)))","v":" "},null,null,null,6,"Ausblenden"]
[null,null,null,null,null,null,51,{"$f":"IF(D62+E62=0,\" \",SUM($H$5+SUM($D$6:$D$52,$D$59:D62)-SUM($E$6:$E$52,$E$59:E62)))","v":" "},null,null,null,6,"Ausblenden"]
[null,null,null,null,null,null,52,{"$f":"IF(D63+E63=0,\" \",SUM($H$5+SUM($D$6:$D$52,$D$59:D63)-SUM($E$6:$E$52,$E$59:E63)))","v":" "},null,null,null,6,"Ausblenden"]
[null,null,null,null,null,null,53,{"$f":"IF(D64+E64=0,\" \",SUM($H$5+SUM($D$6:$D$52,$D$59:D64)-SUM($E$6:$E$52,$E$59:E64)))","v":" "},null,null,null,6,"Ausblenden"]
[null,null,null,null,null,null,54,{"$f":"IF(D65+E65=0,\" \",SUM($H$5+SUM($D$6:$D$52,$D$59:D65)-SUM($E$6:$E$52,$E$59:E65)))","v":" "},null,null,null,6,"Ausblenden"]
[null,null,null,null,null,null,55,{"$f":"IF(D66+E66=0,\" \",SUM($H$5+SUM($D$6:$D$52,$D$59:D66)-SUM($E$6:$E$52,$E$59:E66)))","v":" "},null,null,null,6,"Ausblenden"]
[null,null,null,null,null,null,56,{"$f":"IF(D67+E67=0,\" \",SUM($H$5+SUM($D$6:$D$52,$D$59:D67)-SUM($E$6:$E$52,$E$59:E67)))","v":" "},null,null,null,6,"Ausblenden"]
[null,null,null,null,null,null,57,{"$f":"IF(D68+E68=0,\" \",SUM($H$5+SUM($D$6:$D$52,$D$59:D68)-SUM($E$6:$E$52,$E$59:E68)))","v":" "},null,null,null,6,"Ausblenden"]
[null,null,null,null,null,null,58,{"$f":"IF(D69+E69=0,\" \",SUM($H$5+SUM($D$6:$D$52,$D$59:D69)-SUM($E$6:$E$52,$E$59:E69)))","v":" "},null,null,null,6,"Ausblenden"]
[null,null,null,null,null,null,59,{"$f":"IF(D70+E70=0,\" \",SUM($H$5+SUM($D$6:$D$52,$D$59:D70)-SUM($E$6:$E$52,$E$59:E70)))","v":" "},null,null,null,6,"Ausblenden"]
[null,null,null,null,null,null,60,{"$f":"IF(D71+E71=0,\" \",SUM($H$5+SUM($D$6:$D$52,$D$59:D71)-SUM($E$6:$E$52,$E$59:E71)))","v":" "},null,null,null,6,"Ausblenden"]
[null,null,null,null,null,null,61,{"$f":"IF(D72+E72=0,\" \",SUM($H$5+SUM($D$6:$D$52,$D$59:D72)-SUM($E$6:$E$52,$E$59:E72)))","v":" "},null,null,null,6,"Ausblenden"]
[null,null,null,null,null,null,62,{"$f":"IF(D73+E73=0,\" \",SUM($H$5+SUM($D$6:$D$52,$D$59:D73)-SUM($E$6:$E$52,$E$59:E73)))","v":" "},null,null,null,6,"Ausblenden"]
[null,null,null,null,null,null,63,{"$f":"IF(D74+E74=0,\" \",SUM($H$5+SUM($D$6:$D$52,$D$59:D74)-SUM($E$6:$E$52,$E$59:E74)))","v":" "},null,null,null,6,"Ausblenden"]
[null,null,null,null,null,null,64,{"$f":"IF(D75+E75=0,\" \",SUM($H$5+SUM($D$6:$D$52,$D$59:D75)-SUM($E$6:$E$52,$E$59:E75)))","v":" "},null,null,null,6,"Ausblenden"]
[null,null,null,null,null,null,65,{"$f":"IF(D76+E76=0,\" \",SUM($H$5+SUM($D$6:$D$52,$D$59:D76)-SUM($E$6:$E$52,$E$59:E76)))","v":" "},null,null,null,6,"Ausblenden"]
[null,null,null,null,null,null,66,{"$f":"IF(D77+E77=0,\" \",SUM($H$5+SUM($D$6:$D$52,$D$59:D77)-SUM($E$6:$E$52,$E$59:E77)))","v":" "},null,null,null,6,"Ausblenden"]
[null,null,null,null,null,null,67,{"$f":"IF(D78+E78=0,\" \",SUM($H$5+SUM($D$6:$D$52,$D$59:D78)-SUM($E$6:$E$52,$E$59:E78)))","v":" "},null,null,null,6,"Ausblenden"]
[null,null,null,null,null,null,68,{"$f":"IF(D79+E79=0,\" \",SUM($H$5+SUM($D$6:$D$52,$D$59:D79)-SUM($E$6:$E$52,$E$59:E79)))","v":" "},null,null,null,6,"Ausblenden"]
[null,null,null,null,null,null,69,{"$f":"IF(D80+E80=0,\" \",SUM($H$5+SUM($D$6:$D$52,$D$59:D80)-SUM($E$6:$E$52,$E$59:E80)))","v":" "},null,null,null,6,"Ausblenden"]
[null,null,null,null,null,null,70,{"$f":"IF(D81+E81=0,\" \",SUM($H$5+SUM($D$6:$D$52,$D$59:D81)-SUM($E$6:$E$52,$E$59:E81)))","v":" "},null,null,null,6,"Ausblenden"]
[null,null,null,null,null,null,71,{"$f":"IF(D82+E82=0,\" \",SUM($H$5+SUM($D$6:$D$52,$D$59:D82)-SUM($E$6:$E$52,$E$59:E82)))","v":" "},null,null,null,6,"Ausblenden"]
[null,null,null,null,null,null,72,{"$f":"IF(D83+E83=0,\" \",SUM($H$5+SUM($D$6:$D$52,$D$59:D83)-SUM($E$6:$E$52,$E$59:E83)))","v":" "},null,null,null,6,"Ausblenden"]
[null,null,null,null,null,null,73,{"$f":"IF(D84+E84=0,\" \",SUM($H$5+SUM($D$6:$D$52,$D$59:D84)-SUM($E$6:$E$52,$E$59:E84)))","v":" "},null,null,null,6,"Ausblenden"]
[null,null,null,null,null,null,74,{"$f":"IF(D85+E85=0,\" \",SUM($H$5+SUM($D$6:$D$52,$D$59:D85)-SUM($E$6:$E$52,$E$59:E85)))","v":" "},null,null,null,6,"Ausblenden"]
[null,null,null,null,null,null,75,{"$f":"IF(D86+E86=0,\" \",SUM($H$5+SUM($D$6:$D$52,$D$59:D86)-SUM($E$6:$E$52,$E$59:E86)))","v":" "},null,null,null,6,"Ausblenden"]
[null,null,null,null,null,null,76,{"$f":"IF(D87+E87=0,\" \",SUM($H$5+SUM($D$6:$D$52,$D$59:D87)-SUM($E$6:$E$52,$E$59:E87)))","v":" "},null,null,null,6,"Ausblenden"]
[null,null,null,null,null,null,77,{"$f":"IF(D88+E88=0,\" \",SUM($H$5+SUM($D$6:$D$52,$D$59:D88)-SUM($E$6:$E$52,$E$59:E88)))","v":" "},null,null,null,6,"Ausblenden"]
[null,null,null,null,null,null,78,{"$f":"IF(D89+E89=0,\" \",SUM($H$5+SUM($D$6:$D$52,$D$59:D89)-SUM($E$6:$E$52,$E$59:E89)))","v":" "},null,null,null,6,"Ausblenden"]
[null,null,null,null,null,null,79,{"$f":"IF(D90+E90=0,\" \",SUM($H$5+SUM($D$6:$D$52,$D$59:D90)-SUM($E$6:$E$52,$E$59:E90)))","v":" "},null,null,null,6,"Ausblenden"]
[null,null,null,null,null,null,80,{"$f":"IF(D91+E91=0,\" \",SUM($H$5+SUM($D$6:$D$52,$D$59:D91)-SUM($E$6:$E$52,$E$59:E91)))","v":" "},null,null,null,6,"Ausblenden"]
[null,null,null,null,null,null,81,{"$f":"IF(D92+E92=0,\" \",SUM($H$5+SUM($D$6:$D$52,$D$59:D92)-SUM($E$6:$E$52,$E$59:E92)))","v":" "},null,null,null,6,"Ausblenden"]
[null,null,null,null,null,null,82,{"$f":"IF(D93+E93=0,\" \",SUM($H$5+SUM($D$6:$D$52,$D$59:D93)-SUM($E$6:$E$52,$E$59:E93)))","v":" "},null,null,null,6,"Ausblenden"]
[null,null,null,null,null,null,83,{"$f":"IF(D94+E94=0,\" \",SUM($H$5+SUM($D$6:$D$52,$D$59:D94)-SUM($E$6:$E$52,$E$59:E94)))","v":" "},null,null,null,6,"Ausblenden"]
[null,null,null,null,null,null,84,{"$f":"IF(D95+E95=0,\" \",SUM($H$5+SUM($D$6:$D$52,$D$59:D95)-SUM($E$6:$E$52,$E$59:E95)))","v":" "},null,null,null,6,"Ausblenden"]
[null,null,null,null,null,null,85,{"$f":"IF(D96+E96=0,\" \",SUM($H$5+SUM($D$6:$D$52,$D$59:D96)-SUM($E$6:$E$52,$E$59:E96)))","v":" "},null,null,null,6,"Ausblenden"]
[null,null,null,null,null,null,86,{"$f":"IF(D97+E97=0,\" \",SUM($H$5+SUM($D$6:$D$52,$D$59:D97)-SUM($E$6:$E$52,$E$59:E97)))","v":" "},null,null,null,6,"Ausblenden"]
[null,null,null,null,null,null,87,{"$f":"IF(D98+E98=0,\" \",SUM($H$5+SUM($D$6:$D$52,$D$59:D98)-SUM($E$6:$E$52,$E$59:E98)))","v":" "},null,null,null,6,"Ausblenden"]
[null,null,null,null,null,null,88,{"$f":"IF(D99+E99=0,\" \",SUM($H$5+SUM($D$6:$D$52,$D$59:D99)-SUM($E$6:$E$52,$E$59:E99)))","v":" "},null,null,null,6,"Ausblenden"]
[null,null,null,null,null,null,89,{"$f":"IF(D100+E100=0,\" \",SUM($H$5+SUM($D$6:$D$52,$D$59:D100)-SUM($E$6:$E$52,$E$59:E100)))","v":" "},null,null,null,6,"Ausblenden"]
[null,null,null,null,null,null,90,{"$f":"IF(D101+E101=0,\" \",SUM($H$5+SUM($D$6:$D$52,$D$59:D101)-SUM($E$6:$E$52,$E$59:E101)))","v":" "},null,null,null,6,"Ausblenden"]
[null,null,null,null,null,null,91,{"$f":"IF(D102+E102=0,\" \",SUM($H$5+SUM($D$6:$D$52,$D$59:D102)-SUM($E$6:$E$52,$E$59:E102)))","v":" "},null,null,null,6,"Ausblenden"]
[null,null,null,null,null,null,92,{"$f":"IF(D103+E103=0,\" \",SUM($H$5+SUM($D$6:$D$52,$D$59:D103)-SUM($E$6:$E$52,$E$59:E103)))","v":" "},null,null,null,6,"Ausblenden"]
[null,null,null,null,null,null,93,{"$f":"IF(D104+E104=0,\" \",SUM($H$5+SUM($D$6:$D$52,$D$59:D104)-SUM($E$6:$E$52,$E$59:E104)))","v":" "},null,null,null,6,"Ausblenden"]
[null,null,null,null,null,null,94,{"$f":"IF(D105+E105=0,\" \",SUM($H$5+SUM($D$6:$D$52,$D$59:D105)-SUM($E$6:$E$52,$E$59:E105)))","v":" "},null,null,null,{"$f":"COUNTIF(A105:F105,\"\")","v":6},"Ausblenden"]
[null,{"$f":"IF(SUM(D112:E158)<>0,\"Uebertrag\",\"Total\")","v":"Total"},null,{"$f":"SUM(D58:D105)","v":0},{"$f":"SUM(E58:E105)","v":0},null,null,{"$f":"$H$5+D106-E106","v":0},null,null,null,null,{"$f":"IF(SUM($L$59:$L$105)<282,\"Einblenden\",\"Ausblenden\")","v":"Ausblenden"}]
[{"$f":"A1","v":"2023-10-07"},null,null,null,null,null,null,"Seite 3",null,null,null,null,{"$f":"IF(SUM($L$112:$L$158)<282,\"Einblenden\",\"Ausblenden\")","v":"Ausblenden"}]
[null,null,null,null,null,null,null,null,null,null,null,null,{"$f":"IF(SUM($L$112:$L$158)<282,\"Einblenden\",\"Ausblenden\")","v":"Ausblenden"}]
["Datum:","Text","FIBU","Einnahmen","Ausgaben",{"$f":"F3","v":"?"},null,"Saldo",null,null,null,null,{"$f":"IF(SUM($L$112:$L$158)<282,\"Einblenden\",\"Ausblenden\")","v":"Ausblenden"}]
[null,null,null,null,null,null,null,null,null,null,null,null,{"$f":"IF(SUM($L$112:$L$158)<282,\"Einblenden\",\"Ausblenden\")","v":"Ausblenden"}]
[null,"Uebertrag",null,{"$f":"D106","v":0},{"$f":"E106","v":0},null,null,{"$f":"H106","v":0},null,null,null,null,{"$f":"IF(SUM($L$112:$L$158)<282,\"Einblenden\",\"Ausblenden\")","v":"Ausblenden"}]
[null,null,null,null,null,null,95,{"$f":"IF(D112+E112=0,\" \",SUM($H$5+SUM($D$6:$D$52,$D$59:$D$105,$D$112:D112)-SUM($E$6:$E$52,$E$59:$E$105,$E$112:E112)))","v":" "},null,null,null,{"$f":"COUNTIF(A112:F112,\"\")","v":6},{"$f":"IF(L112<6,\"Einblenden\",\"Ausblenden\")","v":"Ausblenden"}]
[null,null,null,null,null,null,96,{"$f":"IF(D113+E113=0,\" \",SUM($H$5+SUM($D$6:$D$52,$D$59:$D$105,$D$112:D113)-SUM($E$6:$E$52,$E$59:$E$105,$E$112:E113)))","v":" "},null,null,null,{"$f":"COUNTIF(A113:F113,\"\")","v":6},"Ausblenden"]
[null,null,null,null,null,null,97,{"$f":"IF(D114+E114=0,\" \",SUM($H$5+SUM($D$6:$D$52,$D$59:$D$105,$D$112:D114)-SUM($E$6:$E$52,$E$59:$E$105,$E$112:E114)))","v":" "},null,null,null,6,"Ausblenden"]
[null,null,null,null,null,null,98,{"$f":"IF(D115+E115=0,\" \",SUM($H$5+SUM($D$6:$D$52,$D$59:$D$105,$D$112:D115)-SUM($E$6:$E$52,$E$59:$E$105,$E$112:E115)))","v":" "},null,null,null,6,"Ausblenden"]
[null,null,null,null,null,null,99,{"$f":"IF(D116+E116=0,\" \",SUM($H$5+SUM($D$6:$D$52,$D$59:$D$105,$D$112:D116)-SUM($E$6:$E$52,$E$59:$E$105,$E$112:E116)))","v":" "},null,null,null,6,"Ausblenden"]
[null,null,null,null,null,null,100,{"$f":"IF(D117+E117=0,\" \",SUM($H$5+SUM($D$6:$D$52,$D$59:$D$105,$D$112:D117)-SUM($E$6:$E$52,$E$59:$E$105,$E$112:E117)))","v":" "},null,null,null,6,"Ausblenden"]
[null,null,null,null,null,null,101,{"$f":"IF(D118+E118=0,\" \",SUM($H$5+SUM($D$6:$D$52,$D$59:$D$105,$D$112:D118)-SUM($E$6:$E$52,$E$59:$E$105,$E$112:E118)))","v":" "},null,null,null,6,"Ausblenden"]
[null,null,null,null,null,null,102,{"$f":"IF(D119+E119=0,\" \",SUM($H$5+SUM($D$6:$D$52,$D$59:$D$105,$D$112:D119)-SUM($E$6:$E$52,$E$59:$E$105,$E$112:E119)))","v":" "},null,null,null,6,"Ausblenden"]
[null,null,null,null,null,null,103,{"$f":"IF(D120+E120=0,\" \",SUM($H$5+SUM($D$6:$D$52,$D$59:$D$105,$D$112:D120)-SUM($E$6:$E$52,$E$59:$E$105,$E$112:E120)))","v":" "},null,null,null,6,"Ausblenden"]
[null,null,null,null,null,null,104,{"$f":"IF(D121+E121=0,\" \",SUM($H$5+SUM($D$6:$D$52,$D$59:$D$105,$D$112:D121)-SUM($E$6:$E$52,$E$59:$E$105,$E$112:E121)))","v":" "},null,null,null,6,"Ausblenden"]
[null,null,null,null,null,null,105,{"$f":"IF(D122+E122=0,\" \",SUM($H$5+SUM($D$6:$D$52,$D$59:$D$105,$D$112:D122)-SUM($E$6:$E$52,$E$59:$E$105,$E$112:E122)))","v":" "},null,null,null,6,"Ausblenden"]
[null,null,null,null,null,null,106,{"$f":"IF(D123+E123=0,\" \",SUM($H$5+SUM($D$6:$D$52,$D$59:$D$105,$D$112:D123)-SUM($E$6:$E$52,$E$59:$E$105,$E$112:E123)))","v":" "},null,null,null,6,"Ausblenden"]
[null,null,null,null,null,null,107,{"$f":"IF(D124+E124=0,\" \",SUM($H$5+SUM($D$6:$D$52,$D$59:$D$105,$D$112:D124)-SUM($E$6:$E$52,$E$59:$E$105,$E$112:E124)))","v":" "},null,null,null,6,"Ausblenden"]
[null,null,null,null,null,null,108,{"$f":"IF(D125+E125=0,\" \",SUM($H$5+SUM($D$6:$D$52,$D$59:$D$105,$D$112:D125)-SUM($E$6:$E$52,$E$59:$E$105,$E$112:E125)))","v":" "},null,null,null,6,"Ausblenden"]
[null,null,null,null,null,null,109,{"$f":"IF(D126+E126=0,\" \",SUM($H$5+SUM($D$6:$D$52,$D$59:$D$105,$D$112:D126)-SUM($E$6:$E$52,$E$59:$E$105,$E$112:E126)))","v":" "},null,null,null,6,"Ausblenden"]
[null,null,null,null,null,null,110,{"$f":"IF(D127+E127=0,\" \",SUM($H$5+SUM($D$6:$D$52,$D$59:$D$105,$D$112:D127)-SUM($E$6:$E$52,$E$59:$E$105,$E$112:E127)))","v":" "},null,null,null,6,"Ausblenden"]
[null,null,null,null,null,null,111,{"$f":"IF(D128+E128=0,\" \",SUM($H$5+SUM($D$6:$D$52,$D$59:$D$105,$D$112:D128)-SUM($E$6:$E$52,$E$59:$E$105,$E$112:E128)))","v":" "},null,null,null,6,"Ausblenden"]
[null,null,null,null,null,null,112,{"$f":"IF(D129+E129=0,\" \",SUM($H$5+SUM($D$6:$D$52,$D$59:$D$105,$D$112:D129)-SUM($E$6:$E$52,$E$59:$E$105,$E$112:E129)))","v":" "},null,null,null,6,"Ausblenden"]
[null,null,null,null,null,null,113,{"$f":"IF(D130+E130=0,\" \",SUM($H$5+SUM($D$6:$D$52,$D$59:$D$105,$D$112:D130)-SUM($E$6:$E$52,$E$59:$E$105,$E$112:E130)))","v":" "},null,null,null,6,"Ausblenden"]
[null,null,null,null,null,null,114,{"$f":"IF(D131+E131=0,\" \",SUM($H$5+SUM($D$6:$D$52,$D$59:$D$105,$D$112:D131)-SUM($E$6:$E$52,$E$59:$E$105,$E$112:E131)))","v":" "},null,null,null,6,"Ausblenden"]
[null,null,null,null,null,null,115,{"$f":"IF(D132+E132=0,\" \",SUM($H$5+SUM($D$6:$D$52,$D$59:$D$105,$D$112:D132)-SUM($E$6:$E$52,$E$59:$E$105,$E$112:E132)))","v":" "},null,null,null,6,"Ausblenden"]
[null,null,null,null,null,null,116,{"$f":"IF(D133+E133=0,\" \",SUM($H$5+SUM($D$6:$D$52,$D$59:$D$105,$D$112:D133)-SUM($E$6:$E$52,$E$59:$E$105,$E$112:E133)))","v":" "},null,null,null,6,"Ausblenden"]
[null,null,null,null,null,null,117,{"$f":"IF(D134+E134=0,\" \",SUM($H$5+SUM($D$6:$D$52,$D$59:$D$105,$D$112:D134)-SUM($E$6:$E$52,$E$59:$E$105,$E$112:E134)))","v":" "},null,null,null,6,"Ausblenden"]
[null,null,null,null,null,null,118,{"$f":"IF(D135+E135=0,\" \",SUM($H$5+SUM($D$6:$D$52,$D$59:$D$105,$D$112:D135)-SUM($E$6:$E$52,$E$59:$E$105,$E$112:E135)))","v":" "},null,null,null,6,"Ausblenden"]
[null,null,null,null,null,null,119,{"$f":"IF(D136+E136=0,\" \",SUM($H$5+SUM($D$6:$D$52,$D$59:$D$105,$D$112:D136)-SUM($E$6:$E$52,$E$59:$E$105,$E$112:E136)))","v":" "},null,null,null,6,"Ausblenden"]
[null,null,null,null,null,null,120,{"$f":"IF(D137+E137=0,\" \",SUM($H$5+SUM($D$6:$D$52,$D$59:$D$105,$D$112:D137)-SUM($E$6:$E$52,$E$59:$E$105,$E$112:E137)))","v":" "},null,null,null,6,"Ausblenden"]
[null,null,null,null,null,null,121,{"$f":"IF(D138+E138=0,\" \",SUM($H$5+SUM($D$6:$D$52,$D$59:$D$105,$D$112:D138)-SUM($E$6:$E$52,$E$59:$E$105,$E$112:E138)))","v":" "},null,null,null,6,"Ausblenden"]
[null,null,null,null,null,null,122,{"$f":"IF(D139+E139=0,\" \",SUM($H$5+SUM($D$6:$D$52,$D$59:$D$105,$D$112:D139)-SUM($E$6:$E$52,$E$59:$E$105,$E$112:E139)))","v":" "},null,null,null,6,"Ausblenden"]
[null,null,null,null,null,null,123,{"$f":"IF(D140+E140=0,\" \",SUM($H$5+SUM($D$6:$D$52,$D$59:$D$105,$D$112:D140)-SUM($E$6:$E$52,$E$59:$E$105,$E$112:E140)))","v":" "},null,null,null,6,"Ausblenden"]
[null,null,null,null,null,null,124,{"$f":"IF(D141+E141=0,\" \",SUM($H$5+SUM($D$6:$D$52,$D$59:$D$105,$D$112:D141)-SUM($E$6:$E$52,$E$59:$E$105,$E$112:E141)))","v":" "},null,null,null,6,"Ausblenden"]
[null,null,null,null,null,null,125,{"$f":"IF(D142+E142=0,\" \",SUM($H$5+SUM($D$6:$D$52,$D$59:$D$105,$D$112:D142)-SUM($E$6:$E$52,$E$59:$E$105,$E$112:E142)))","v":" "},null,null,null,6,"Ausblenden"]
[null,null,null,null,null,null,126,{"$f":"IF(D143+E143=0,\" \",SUM($H$5+SUM($D$6:$D$52,$D$59:$D$105,$D$112:D143)-SUM($E$6:$E$52,$E$59:$E$105,$E$112:E143)))","v":" "},null,null,null,6,"Ausblenden"]
[null,null,null,null,null,null,127,{"$f":"IF(D144+E144=0,\" \",SUM($H$5+SUM($D$6:$D$52,$D$59:$D$105,$D$112:D144)-SUM($E$6:$E$52,$E$59:$E$105,$E$112:E144)))","v":" "},null,null,null,6,"Ausblenden"]
[null,null,null,null,null,null,128,{"$f":"IF(D145+E145=0,\" \",SUM($H$5+SUM($D$6:$D$52,$D$59:$D$105,$D$112:D145)-SUM($E$6:$E$52,$E$59:$E$105,$E$112:E145)))","v":" "},null,null,null,6,"Ausblenden"]
[null,null,null,null,null,null,129,{"$f":"IF(D146+E146=0,\" \",SUM($H$5+SUM($D$6:$D$52,$D$59:$D$105,$D$112:D146)-SUM($E$6:$E$52,$E$59:$E$105,$E$112:E146)))","v":" "},null,null,null,6,"Ausblenden"]
[null,null,null,null,null,null,130,{"$f":"IF(D147+E147=0,\" \",SUM($H$5+SUM($D$6:$D$52,$D$59:$D$105,$D$112:D147)-SUM($E$6:$E$52,$E$59:$E$105,$E$112:E147)))","v":" "},null,null,null,6,"Ausblenden"]
[null,null,null,null,null,null,131,{"$f":"IF(D148+E148=0,\" \",SUM($H$5+SUM($D$6:$D$52,$D$59:$D$105,$D$112:D148)-SUM($E$6:$E$52,$E$59:$E$105,$E$112:E148)))","v":" "},null,null,null,6,"Ausblenden"]
[null,null,null,null,null,null,132,{"$f":"IF(D149+E149=0,\" \",SUM($H$5+SUM($D$6:$D$52,$D$59:$D$105,$D$112:D149)-SUM($E$6:$E$52,$E$59:$E$105,$E$112:E149)))","v":" "},null,null,null,6,"Ausblenden"]
[null,null,null,null,null,null,133,{"$f":"IF(D150+E150=0,\" \",SUM($H$5+SUM($D$6:$D$52,$D$59:$D$105,$D$112:D150)-SUM($E$6:$E$52,$E$59:$E$105,$E$112:E150)))","v":" "},null,null,null,6,"Ausblenden"]
[null,null,null,null,null,null,134,{"$f":"IF(D151+E151=0,\" \",SUM($H$5+SUM($D$6:$D$52,$D$59:$D$105,$D$112:D151)-SUM($E$6:$E$52,$E$59:$E$105,$E$112:E151)))","v":" "},null,null,null,6,"Ausblenden"]
[null,null,null,null,null,null,135,{"$f":"IF(D152+E152=0,\" \",SUM($H$5+SUM($D$6:$D$52,$D$59:$D$105,$D$112:D152)-SUM($E$6:$E$52,$E$59:$E$105,$E$112:E152)))","v":" "},null,null,null,6,"Ausblenden"]
[null,null,null,null,null,null,136,{"$f":"IF(D153+E153=0,\" \",SUM($H$5+SUM($D$6:$D$52,$D$59:$D$105,$D$112:D153)-SUM($E$6:$E$52,$E$59:$E$105,$E$112:E153)))","v":" "},null,null,null,6,"Ausblenden"]
[null,null,null,null,null,null,137,{"$f":"IF(D154+E154=0,\" \",SUM($H$5+SUM($D$6:$D$52,$D$59:$D$105,$D$112:D154)-SUM($E$6:$E$52,$E$59:$E$105,$E$112:E154)))","v":" "},null,null,null,6,"Ausblenden"]
[null,null,null,null,null,null,138,{"$f":"IF(D155+E155=0,\" \",SUM($H$5+SUM($D$6:$D$52,$D$59:$D$105,$D$112:D155)-SUM($E$6:$E$52,$E$59:$E$105,$E$112:E155)))","v":" "},null,null,null,6,"Ausblenden"]
[null,null,null,null,null,null,139,{"$f":"IF(D156+E156=0,\" \",SUM($H$5+SUM($D$6:$D$52,$D$59:$D$105,$D$112:D156)-SUM($E$6:$E$52,$E$59:$E$105,$E$112:E156)))","v":" "},null,null,null,6,"Ausblenden"]
[null,null,null,null,null,null,140,{"$f":"IF(D157+E157=0,\" \",SUM($H$5+SUM($D$6:$D$52,$D$59:$D$105,$D$112:D157)-SUM($E$6:$E$52,$E$59:$E$105,$E$112:E157)))","v":" "},null,null,null,6,"Ausblenden"]
[null,null,null,null,null,null,141,{"$f":"IF(D158+E158=0,\" \",SUM($H$5+SUM($D$6:$D$52,$D$59:$D$105,$D$112:D158)-SUM($E$6:$E$52,$E$59:$E$105,$E$112:E158)))","v":" "},null,null,null,6,"Ausblenden"]
[null,"Total",null,{"$f":"SUM(D111:D158)","v":0},{"$f":"SUM(E111:E158)","v":0},null,null,{"$f":"$H$5+D159-E159","v":0},null,null,null,null,{"$f":"IF(SUM($L$112:$L$158)<282,\"Einblenden\",\"Ausblenden\")","v":"Ausblenden"}]

{"sheet":"November","index":11,"n_rows":159,"n_cols":13,"rows_kept":159,"cut":false,"hidden":false,"merged":[]}
[{"$f":"Oktober!A1+31","v":"2023-11-07"}]
[]
["Datum:","Text","FIBU","Einnahmen","Ausgaben",{"$f":"Januar!F3","v":"?"},null,"Saldo"]
[]
[1,"Saldovortrag",null,null,null,null,null,{"$f":"SUM(Oktober!H159)","v":0}]
[null,null,null,null,null,null,1,{"$f":"IF(D6+E6=0,\" \",SUM($H$5+SUM($D$6:D6)-SUM($E$6:E6)))","v":" "},null,null,null,null,"Einblenden"]
[null,null,null,null,null,null,2,{"$f":"IF(D7+E7=0,\" \",SUM($H$5+SUM($D$6:D7)-SUM($E$6:E7)))","v":" "},null,null,null,{"$f":"COUNTIF(A7:F7,\"\")","v":6},{"$f":"IF(L7<6,\"Einblenden\",\"Ausblenden\")","v":"Ausblenden"}]
[null,null,null,null,null,null,3,{"$f":"IF(D8+E8=0,\" \",SUM($H$5+SUM($D$6:D8)-SUM($E$6:E8)))","v":" "},null,null,null,{"$f":"COUNTIF(A8:F8,\"\")","v":6},{"$f":"IF(L8<6,\"Einblenden\",\"Ausblenden\")","v":"Ausblenden"}]
[null,null,null,null,null,null,4,{"$f":"IF(D9+E9=0,\" \",SUM($H$5+SUM($D$6:D9)-SUM($E$6:E9)))","v":" "},null,null,null,6,"Ausblenden"]
[null,null,null,null,null,null,5,{"$f":"IF(D10+E10=0,\" \",SUM($H$5+SUM($D$6:D10)-SUM($E$6:E10)))","v":" "},null,null,null,6,"Ausblenden"]
[null,null,null,null,null,null,6,{"$f":"IF(D11+E11=0,\" \",SUM($H$5+SUM($D$6:D11)-SUM($E$6:E11)))","v":" "},null,null,null,6,"Ausblenden"]
[null,null,null,null,null,null,7,{"$f":"IF(D12+E12=0,\" \",SUM($H$5+SUM($D$6:D12)-SUM($E$6:E12)))","v":" "},null,null,null,6,"Ausblenden"]
[null,null,null,null,null,null,8,{"$f":"IF(D13+E13=0,\" \",SUM($H$5+SUM($D$6:D13)-SUM($E$6:E13)))","v":" "},null,null,null,6,"Ausblenden"]
[null,null,null,null,null,null,9,{"$f":"IF(D14+E14=0,\" \",SUM($H$5+SUM($D$6:D14)-SUM($E$6:E14)))","v":" "},null,null,null,6,"Ausblenden"]
[null,null,null,null,null,null,10,{"$f":"IF(D15+E15=0,\" \",SUM($H$5+SUM($D$6:D15)-SUM($E$6:E15)))","v":" "},null,null,null,6,"Ausblenden"]
[null,null,null,null,null,null,11,{"$f":"IF(D16+E16=0,\" \",SUM($H$5+SUM($D$6:D16)-SUM($E$6:E16)))","v":" "},null,null,null,6,"Ausblenden"]
[null,null,null,null,null,null,12,{"$f":"IF(D17+E17=0,\" \",SUM($H$5+SUM($D$6:D17)-SUM($E$6:E17)))","v":" "},null,null,null,6,"Ausblenden"]
[null,null,null,null,null,null,13,{"$f":"IF(D18+E18=0,\" \",SUM($H$5+SUM($D$6:D18)-SUM($E$6:E18)))","v":" "},null,null,null,6,"Ausblenden"]
[null,null,null,null,null,null,14,{"$f":"IF(D19+E19=0,\" \",SUM($H$5+SUM($D$6:D19)-SUM($E$6:E19)))","v":" "},null,null,null,6,"Ausblenden"]
[null,null,null,null,null,null,15,{"$f":"IF(D20+E20=0,\" \",SUM($H$5+SUM($D$6:D20)-SUM($E$6:E20)))","v":" "},null,null,null,6,"Ausblenden"]
[null,null,null,null,null,null,16,{"$f":"IF(D21+E21=0,\" \",SUM($H$5+SUM($D$6:D21)-SUM($E$6:E21)))","v":" "},null,null,null,6,"Ausblenden"]
[null,null,null,null,null,null,17,{"$f":"IF(D22+E22=0,\" \",SUM($H$5+SUM($D$6:D22)-SUM($E$6:E22)))","v":" "},null,null,null,6,"Ausblenden"]
[null,null,null,null,null,null,18,{"$f":"IF(D23+E23=0,\" \",SUM($H$5+SUM($D$6:D23)-SUM($E$6:E23)))","v":" "},null,null,null,6,"Ausblenden"]
[null,null,null,null,null,null,19,{"$f":"IF(D24+E24=0,\" \",SUM($H$5+SUM($D$6:D24)-SUM($E$6:E24)))","v":" "},null,null,null,6,"Ausblenden"]
[null,null,null,null,null,null,20,{"$f":"IF(D25+E25=0,\" \",SUM($H$5+SUM($D$6:D25)-SUM($E$6:E25)))","v":" "},null,null,null,6,"Ausblenden"]
[null,null,null,null,null,null,21,{"$f":"IF(D26+E26=0,\" \",SUM($H$5+SUM($D$6:D26)-SUM($E$6:E26)))","v":" "},null,null,null,6,"Ausblenden"]
[null,null,null,null,null,null,22,{"$f":"IF(D27+E27=0,\" \",SUM($H$5+SUM($D$6:D27)-SUM($E$6:E27)))","v":" "},null,null,null,6,"Ausblenden"]
[null,null,null,null,null,null,23,{"$f":"IF(D28+E28=0,\" \",SUM($H$5+SUM($D$6:D28)-SUM($E$6:E28)))","v":" "},null,null,null,6,"Ausblenden"]
[null,null,null,null,null,null,24,{"$f":"IF(D29+E29=0,\" \",SUM($H$5+SUM($D$6:D29)-SUM($E$6:E29)))","v":" "},null,null,null,6,"Ausblenden"]
[null,null,null,null,null,null,25,{"$f":"IF(D30+E30=0,\" \",SUM($H$5+SUM($D$6:D30)-SUM($E$6:E30)))","v":" "},null,null,null,6,"Ausblenden"]
[null,null,null,null,null,null,26,{"$f":"IF(D31+E31=0,\" \",SUM($H$5+SUM($D$6:D31)-SUM($E$6:E31)))","v":" "},null,null,null,6,"Ausblenden"]
[null,null,null,null,null,null,27,{"$f":"IF(D32+E32=0,\" \",SUM($H$5+SUM($D$6:D32)-SUM($E$6:E32)))","v":" "},null,null,null,6,"Ausblenden"]
[null,null,null,null,null,null,28,{"$f":"IF(D33+E33=0,\" \",SUM($H$5+SUM($D$6:D33)-SUM($E$6:E33)))","v":" "},null,null,null,6,"Ausblenden"]
[null,null,null,null,null,null,29,{"$f":"IF(D34+E34=0,\" \",SUM($H$5+SUM($D$6:D34)-SUM($E$6:E34)))","v":" "},null,null,null,6,"Ausblenden"]
[null,null,null,null,null,null,30,{"$f":"IF(D35+E35=0,\" \",SUM($H$5+SUM($D$6:D35)-SUM($E$6:E35)))","v":" "},null,null,null,6,"Ausblenden"]
[null,null,null,null,null,null,31,{"$f":"IF(D36+E36=0,\" \",SUM($H$5+SUM($D$6:D36)-SUM($E$6:E36)))","v":" "},null,null,null,6,"Ausblenden"]
[null,null,null,null,null,null,32,{"$f":"IF(D37+E37=0,\" \",SUM($H$5+SUM($D$6:D37)-SUM($E$6:E37)))","v":" "},null,null,null,6,"Ausblenden"]
[null,null,null,null,null,null,33,{"$f":"IF(D38+E38=0,\" \",SUM($H$5+SUM($D$6:D38)-SUM($E$6:E38)))","v":" "},null,null,null,6,"Ausblenden"]
[null,null,null,null,null,null,34,{"$f":"IF(D39+E39=0,\" \",SUM($H$5+SUM($D$6:D39)-SUM($E$6:E39)))","v":" "},null,null,null,6,"Ausblenden"]
[null,null,null,null,null,null,35,{"$f":"IF(D40+E40=0,\" \",SUM($H$5+SUM($D$6:D40)-SUM($E$6:E40)))","v":" "},null,null,null,6,"Ausblenden"]
[null,null,null,null,null,null,36,{"$f":"IF(D41+E41=0,\" \",SUM($H$5+SUM($D$6:D41)-SUM($E$6:E41)))","v":" "},null,null,null,6,"Ausblenden"]
[null,null,null,null,null,null,37,{"$f":"IF(D42+E42=0,\" \",SUM($H$5+SUM($D$6:D42)-SUM($E$6:E42)))","v":" "},null,null,null,6,"Ausblenden"]
[null,null,null,null,null,null,38,{"$f":"IF(D43+E43=0,\" \",SUM($H$5+SUM($D$6:D43)-SUM($E$6:E43)))","v":" "},null,null,null,6,"Ausblenden"]
[null,null,null,null,null,null,39,{"$f":"IF(D44+E44=0,\" \",SUM($H$5+SUM($D$6:D44)-SUM($E$6:E44)))","v":" "},null,null,null,6,"Ausblenden"]
[null,null,null,null,null,null,40,{"$f":"IF(D45+E45=0,\" \",SUM($H$5+SUM($D$6:D45)-SUM($E$6:E45)))","v":" "},null,null,null,6,"Ausblenden"]
[null,null,null,null,null,null,41,{"$f":"IF(D46+E46=0,\" \",SUM($H$5+SUM($D$6:D46)-SUM($E$6:E46)))","v":" "},null,null,null,6,"Ausblenden"]
[null,null,null,null,null,null,42,{"$f":"IF(D47+E47=0,\" \",SUM($H$5+SUM($D$6:D47)-SUM($E$6:E47)))","v":" "},null,null,null,6,"Ausblenden"]
[null,null,null,null,null,null,43,{"$f":"IF(D48+E48=0,\" \",SUM($H$5+SUM($D$6:D48)-SUM($E$6:E48)))","v":" "},null,null,null,6,"Ausblenden"]
[null,null,null,null,null,null,44,{"$f":"IF(D49+E49=0,\" \",SUM($H$5+SUM($D$6:D49)-SUM($E$6:E49)))","v":" "},null,null,null,6,"Ausblenden"]
[null,null,null,null,null,null,45,{"$f":"IF(D50+E50=0,\" \",SUM($H$5+SUM($D$6:D50)-SUM($E$6:E50)))","v":" "},null,null,null,6,"Ausblenden"]
[null,null,null,null,null,null,46,{"$f":"IF(D51+E51=0,\" \",SUM($H$5+SUM($D$6:D51)-SUM($E$6:E51)))","v":" "},null,null,null,6,"Ausblenden"]
[null,null,null,null,null,null,47,{"$f":"IF(D52+E52=0,\" \",SUM($H$5+SUM($D$6:D52)-SUM($E$6:E52)))","v":" "},null,null,null,6,"Ausblenden"]
[null,{"$f":"IF(SUM(D59:E105)<>0,\"Uebertrag\",\"Total\")","v":"Total"},null,{"$f":"SUM(D5:D52)","v":0},{"$f":"SUM(E5:E52)","v":0},null,null,{"$f":"H5+D53-E53","v":0},null,null,null,null,"Einblenden"]
[{"$f":"A1","v":"2023-11-07"},null,null,null,null,null,null,"Seite 2",null,null,null,null,{"$f":"IF(SUM($L$59:$L$105)<282,\"Einblenden\",\"Ausblenden\")","v":"Ausblenden"}]
[null,null,null,null,null,null,null,null,null,null,null,null,{"$f":"IF(SUM($L$59:$L$105)<282,\"Einblenden\",\"Ausblenden\")","v":"Ausblenden"}]
["Datum:","Text","FIBU","Einnahmen","Ausgaben",{"$f":"F3","v":"?"},null,"Saldo",null,null,null,null,{"$f":"IF(SUM($L$59:$L$105)<282,\"Einblenden\",\"Ausblenden\")","v":"Ausblenden"}]
[null,null,null,null,null,null,null,null,null,null,null,null,{"$f":"IF(SUM($L$59:$L$105)<282,\"Einblenden\",\"Ausblenden\")","v":"Ausblenden"}]
[null,"Uebertrag",null,{"$f":"D53","v":0},{"$f":"E53","v":0},null,null,{"$f":"H53","v":0},null,null,null,null,{"$f":"IF(SUM($L$59:$L$105)<282,\"Einblenden\",\"Ausblenden\")","v":"Ausblenden"}]
[null,null,null,null,null,null,48,{"$f":"IF(D59+E59=0,\" \",SUM($H$5+SUM($D$6:$D$52,$D$59:D59)-SUM($E$6:$E$52,$E$59:E59)))","v":" "},null,null,null,{"$f":"COUNTIF(A59:F59,\"\")","v":6},{"$f":"IF(L59<6,\"Einblenden\",\"Ausblenden\")","v":"Ausblenden"}]
[null,null,null,null,null,null,49,{"$f":"IF(D60+E60=0,\" \",SUM($H$5+SUM($D$6:$D$52,$D$59:D60)-SUM($E$6:$E$52,$E$59:E60)))","v":" "},null,null,null,{"$f":"COUNTIF(A60:F60,\"\")","v":6},{"$f":"IF(L60<6,\"Einblenden\",\"Ausblenden\")","v":"Ausblenden"}]
[null,null,null,null,null,null,50,{"$f":"IF(D61+E61=0,\" \",SUM($H$5+SUM($D$6:$D$52,$D$59:D61)-SUM($E$6:$E$52,$E$59:E61)))","v":" "},null,null,null,6,"Ausblenden"]
[null,null,null,null,null,null,51,{"$f":"IF(D62+E62=0,\" \",SUM($H$5+SUM($D$6:$D$52,$D$59:D62)-SUM($E$6:$E$52,$E$59:E62)))","v":" "},null,null,null,6,"Ausblenden"]
[null,null,null,null,null,null,52,{"$f":"IF(D63+E63=0,\" \",SUM($H$5+SUM($D$6:$D$52,$D$59:D63)-SUM($E$6:$E$52,$E$59:E63)))","v":" "},null,null,null,6,"Ausblenden"]
[null,null,null,null,null,null,53,{"$f":"IF(D64+E64=0,\" \",SUM($H$5+SUM($D$6:$D$52,$D$59:D64)-SUM($E$6:$E$52,$E$59:E64)))","v":" "},null,null,null,6,"Ausblenden"]
[null,null,null,null,null,null,54,{"$f":"IF(D65+E65=0,\" \",SUM($H$5+SUM($D$6:$D$52,$D$59:D65)-SUM($E$6:$E$52,$E$59:E65)))","v":" "},null,null,null,6,"Ausblenden"]
[null,null,null,null,null,null,55,{"$f":"IF(D66+E66=0,\" \",SUM($H$5+SUM($D$6:$D$52,$D$59:D66)-SUM($E$6:$E$52,$E$59:E66)))","v":" "},null,null,null,6,"Ausblenden"]
[null,null,null,null,null,null,56,{"$f":"IF(D67+E67=0,\" \",SUM($H$5+SUM($D$6:$D$52,$D$59:D67)-SUM($E$6:$E$52,$E$59:E67)))","v":" "},null,null,null,6,"Ausblenden"]
[null,null,null,null,null,null,57,{"$f":"IF(D68+E68=0,\" \",SUM($H$5+SUM($D$6:$D$52,$D$59:D68)-SUM($E$6:$E$52,$E$59:E68)))","v":" "},null,null,null,6,"Ausblenden"]
[null,null,null,null,null,null,58,{"$f":"IF(D69+E69=0,\" \",SUM($H$5+SUM($D$6:$D$52,$D$59:D69)-SUM($E$6:$E$52,$E$59:E69)))","v":" "},null,null,null,6,"Ausblenden"]
[null,null,null,null,null,null,59,{"$f":"IF(D70+E70=0,\" \",SUM($H$5+SUM($D$6:$D$52,$D$59:D70)-SUM($E$6:$E$52,$E$59:E70)))","v":" "},null,null,null,6,"Ausblenden"]
[null,null,null,null,null,null,60,{"$f":"IF(D71+E71=0,\" \",SUM($H$5+SUM($D$6:$D$52,$D$59:D71)-SUM($E$6:$E$52,$E$59:E71)))","v":" "},null,null,null,6,"Ausblenden"]
[null,null,null,null,null,null,61,{"$f":"IF(D72+E72=0,\" \",SUM($H$5+SUM($D$6:$D$52,$D$59:D72)-SUM($E$6:$E$52,$E$59:E72)))","v":" "},null,null,null,6,"Ausblenden"]
[null,null,null,null,null,null,62,{"$f":"IF(D73+E73=0,\" \",SUM($H$5+SUM($D$6:$D$52,$D$59:D73)-SUM($E$6:$E$52,$E$59:E73)))","v":" "},null,null,null,6,"Ausblenden"]
[null,null,null,null,null,null,63,{"$f":"IF(D74+E74=0,\" \",SUM($H$5+SUM($D$6:$D$52,$D$59:D74)-SUM($E$6:$E$52,$E$59:E74)))","v":" "},null,null,null,6,"Ausblenden"]
[null,null,null,null,null,null,64,{"$f":"IF(D75+E75=0,\" \",SUM($H$5+SUM($D$6:$D$52,$D$59:D75)-SUM($E$6:$E$52,$E$59:E75)))","v":" "},null,null,null,6,"Ausblenden"]
[null,null,null,null,null,null,65,{"$f":"IF(D76+E76=0,\" \",SUM($H$5+SUM($D$6:$D$52,$D$59:D76)-SUM($E$6:$E$52,$E$59:E76)))","v":" "},null,null,null,6,"Ausblenden"]
[null,null,null,null,null,null,66,{"$f":"IF(D77+E77=0,\" \",SUM($H$5+SUM($D$6:$D$52,$D$59:D77)-SUM($E$6:$E$52,$E$59:E77)))","v":" "},null,null,null,6,"Ausblenden"]
[null,null,null,null,null,null,67,{"$f":"IF(D78+E78=0,\" \",SUM($H$5+SUM($D$6:$D$52,$D$59:D78)-SUM($E$6:$E$52,$E$59:E78)))","v":" "},null,null,null,6,"Ausblenden"]
[null,null,null,null,null,null,68,{"$f":"IF(D79+E79=0,\" \",SUM($H$5+SUM($D$6:$D$52,$D$59:D79)-SUM($E$6:$E$52,$E$59:E79)))","v":" "},null,null,null,6,"Ausblenden"]
[null,null,null,null,null,null,69,{"$f":"IF(D80+E80=0,\" \",SUM($H$5+SUM($D$6:$D$52,$D$59:D80)-SUM($E$6:$E$52,$E$59:E80)))","v":" "},null,null,null,6,"Ausblenden"]
[null,null,null,null,null,null,70,{"$f":"IF(D81+E81=0,\" \",SUM($H$5+SUM($D$6:$D$52,$D$59:D81)-SUM($E$6:$E$52,$E$59:E81)))","v":" "},null,null,null,6,"Ausblenden"]
[null,null,null,null,null,null,71,{"$f":"IF(D82+E82=0,\" \",SUM($H$5+SUM($D$6:$D$52,$D$59:D82)-SUM($E$6:$E$52,$E$59:E82)))","v":" "},null,null,null,6,"Ausblenden"]
[null,null,null,null,null,null,72,{"$f":"IF(D83+E83=0,\" \",SUM($H$5+SUM($D$6:$D$52,$D$59:D83)-SUM($E$6:$E$52,$E$59:E83)))","v":" "},null,null,null,6,"Ausblenden"]
[null,null,null,null,null,null,73,{"$f":"IF(D84+E84=0,\" \",SUM($H$5+SUM($D$6:$D$52,$D$59:D84)-SUM($E$6:$E$52,$E$59:E84)))","v":" "},null,null,null,6,"Ausblenden"]
[null,null,null,null,null,null,74,{"$f":"IF(D85+E85=0,\" \",SUM($H$5+SUM($D$6:$D$52,$D$59:D85)-SUM($E$6:$E$52,$E$59:E85)))","v":" "},null,null,null,6,"Ausblenden"]
[null,null,null,null,null,null,75,{"$f":"IF(D86+E86=0,\" \",SUM($H$5+SUM($D$6:$D$52,$D$59:D86)-SUM($E$6:$E$52,$E$59:E86)))","v":" "},null,null,null,6,"Ausblenden"]
[null,null,null,null,null,null,76,{"$f":"IF(D87+E87=0,\" \",SUM($H$5+SUM($D$6:$D$52,$D$59:D87)-SUM($E$6:$E$52,$E$59:E87)))","v":" "},null,null,null,6,"Ausblenden"]
[null,null,null,null,null,null,77,{"$f":"IF(D88+E88=0,\" \",SUM($H$5+SUM($D$6:$D$52,$D$59:D88)-SUM($E$6:$E$52,$E$59:E88)))","v":" "},null,null,null,6,"Ausblenden"]
[null,null,null,null,null,null,78,{"$f":"IF(D89+E89=0,\" \",SUM($H$5+SUM($D$6:$D$52,$D$59:D89)-SUM($E$6:$E$52,$E$59:E89)))","v":" "},null,null,null,6,"Ausblenden"]
[null,null,null,null,null,null,79,{"$f":"IF(D90+E90=0,\" \",SUM($H$5+SUM($D$6:$D$52,$D$59:D90)-SUM($E$6:$E$52,$E$59:E90)))","v":" "},null,null,null,6,"Ausblenden"]
[null,null,null,null,null,null,80,{"$f":"IF(D91+E91=0,\" \",SUM($H$5+SUM($D$6:$D$52,$D$59:D91)-SUM($E$6:$E$52,$E$59:E91)))","v":" "},null,null,null,6,"Ausblenden"]
[null,null,null,null,null,null,81,{"$f":"IF(D92+E92=0,\" \",SUM($H$5+SUM($D$6:$D$52,$D$59:D92)-SUM($E$6:$E$52,$E$59:E92)))","v":" "},null,null,null,6,"Ausblenden"]
[null,null,null,null,null,null,82,{"$f":"IF(D93+E93=0,\" \",SUM($H$5+SUM($D$6:$D$52,$D$59:D93)-SUM($E$6:$E$52,$E$59:E93)))","v":" "},null,null,null,6,"Ausblenden"]
[null,null,null,null,null,null,83,{"$f":"IF(D94+E94=0,\" \",SUM($H$5+SUM($D$6:$D$52,$D$59:D94)-SUM($E$6:$E$52,$E$59:E94)))","v":" "},null,null,null,6,"Ausblenden"]
[null,null,null,null,null,null,84,{"$f":"IF(D95+E95=0,\" \",SUM($H$5+SUM($D$6:$D$52,$D$59:D95)-SUM($E$6:$E$52,$E$59:E95)))","v":" "},null,null,null,6,"Ausblenden"]
[null,null,null,null,null,null,85,{"$f":"IF(D96+E96=0,\" \",SUM($H$5+SUM($D$6:$D$52,$D$59:D96)-SUM($E$6:$E$52,$E$59:E96)))","v":" "},null,null,null,6,"Ausblenden"]
[null,null,null,null,null,null,86,{"$f":"IF(D97+E97=0,\" \",SUM($H$5+SUM($D$6:$D$52,$D$59:D97)-SUM($E$6:$E$52,$E$59:E97)))","v":" "},null,null,null,6,"Ausblenden"]
[null,null,null,null,null,null,87,{"$f":"IF(D98+E98=0,\" \",SUM($H$5+SUM($D$6:$D$52,$D$59:D98)-SUM($E$6:$E$52,$E$59:E98)))","v":" "},null,null,null,6,"Ausblenden"]
[null,null,null,null,null,null,88,{"$f":"IF(D99+E99=0,\" \",SUM($H$5+SUM($D$6:$D$52,$D$59:D99)-SUM($E$6:$E$52,$E$59:E99)))","v":" "},null,null,null,6,"Ausblenden"]
[null,null,null,null,null,null,89,{"$f":"IF(D100+E100=0,\" \",SUM($H$5+SUM($D$6:$D$52,$D$59:D100)-SUM($E$6:$E$52,$E$59:E100)))","v":" "},null,null,null,6,"Ausblenden"]
[null,null,null,null,null,null,90,{"$f":"IF(D101+E101=0,\" \",SUM($H$5+SUM($D$6:$D$52,$D$59:D101)-SUM($E$6:$E$52,$E$59:E101)))","v":" "},null,null,null,6,"Ausblenden"]
[null,null,null,null,null,null,91,{"$f":"IF(D102+E102=0,\" \",SUM($H$5+SUM($D$6:$D$52,$D$59:D102)-SUM($E$6:$E$52,$E$59:E102)))","v":" "},null,null,null,6,"Ausblenden"]
[null,null,null,null,null,null,92,{"$f":"IF(D103+E103=0,\" \",SUM($H$5+SUM($D$6:$D$52,$D$59:D103)-SUM($E$6:$E$52,$E$59:E103)))","v":" "},null,null,null,6,"Ausblenden"]
[null,null,null,null,null,null,93,{"$f":"IF(D104+E104=0,\" \",SUM($H$5+SUM($D$6:$D$52,$D$59:D104)-SUM($E$6:$E$52,$E$59:E104)))","v":" "},null,null,null,6,"Ausblenden"]
[null,null,null,null,null,null,94,{"$f":"IF(D105+E105=0,\" \",SUM($H$5+SUM($D$6:$D$52,$D$59:D105)-SUM($E$6:$E$52,$E$59:E105)))","v":" "},null,null,null,{"$f":"COUNTIF(A105:F105,\"\")","v":6},"Ausblenden"]
[null,{"$f":"IF(SUM(D112:E158)<>0,\"Uebertrag\",\"Total\")","v":"Total"},null,{"$f":"SUM(D58:D105)","v":0},{"$f":"SUM(E58:E105)","v":0},null,null,{"$f":"$H$5+D106-E106","v":0},null,null,null,null,{"$f":"IF(SUM($L$59:$L$105)<282,\"Einblenden\",\"Ausblenden\")","v":"Ausblenden"}]
[{"$f":"A1","v":"2023-11-07"},null,null,null,null,null,null,"Seite 3",null,null,null,null,{"$f":"IF(SUM($L$112:$L$158)<282,\"Einblenden\",\"Ausblenden\")","v":"Ausblenden"}]
[null,null,null,null,null,null,null,null,null,null,null,null,{"$f":"IF(SUM($L$112:$L$158)<282,\"Einblenden\",\"Ausblenden\")","v":"Ausblenden"}]
["Datum:","Text","FIBU","Einnahmen","Ausgaben",{"$f":"F3","v":"?"},null,"Saldo",null,null,null,null,{"$f":"IF(SUM($L$112:$L$158)<282,\"Einblenden\",\"Ausblenden\")","v":"Ausblenden"}]
[null,null,null,null,null,null,null,null,null,null,null,null,{"$f":"IF(SUM($L$112:$L$158)<282,\"Einblenden\",\"Ausblenden\")","v":"Ausblenden"}]
[null,"Uebertrag",null,{"$f":"D106","v":0},{"$f":"E106","v":0},null,null,{"$f":"H106","v":0},null,null,null,null,{"$f":"IF(SUM($L$112:$L$158)<282,\"Einblenden\",\"Ausblenden\")","v":"Ausblenden"}]
[null,null,null,null,null,null,95,{"$f":"IF(D112+E112=0,\" \",SUM($H$5+SUM($D$6:$D$52,$D$59:$D$105,$D$112:D112)-SUM($E$6:$E$52,$E$59:$E$105,$E$112:E112)))","v":" "},null,null,null,{"$f":"COUNTIF(A112:F112,\"\")","v":6},{"$f":"IF(L112<6,\"Einblenden\",\"Ausblenden\")","v":"Ausblenden"}]
[null,null,null,null,null,null,96,{"$f":"IF(D113+E113=0,\" \",SUM($H$5+SUM($D$6:$D$52,$D$59:$D$105,$D$112:D113)-SUM($E$6:$E$52,$E$59:$E$105,$E$112:E113)))","v":" "},null,null,null,{"$f":"COUNTIF(A113:F113,\"\")","v":6},"Ausblenden"]
[null,null,null,null,null,null,97,{"$f":"IF(D114+E114=0,\" \",SUM($H$5+SUM($D$6:$D$52,$D$59:$D$105,$D$112:D114)-SUM($E$6:$E$52,$E$59:$E$105,$E$112:E114)))","v":" "},null,null,null,6,"Ausblenden"]
[null,null,null,null,null,null,98,{"$f":"IF(D115+E115=0,\" \",SUM($H$5+SUM($D$6:$D$52,$D$59:$D$105,$D$112:D115)-SUM($E$6:$E$52,$E$59:$E$105,$E$112:E115)))","v":" "},null,null,null,6,"Ausblenden"]
[null,null,null,null,null,null,99,{"$f":"IF(D116+E116=0,\" \",SUM($H$5+SUM($D$6:$D$52,$D$59:$D$105,$D$112:D116)-SUM($E$6:$E$52,$E$59:$E$105,$E$112:E116)))","v":" "},null,null,null,6,"Ausblenden"]
[null,null,null,null,null,null,100,{"$f":"IF(D117+E117=0,\" \",SUM($H$5+SUM($D$6:$D$52,$D$59:$D$105,$D$112:D117)-SUM($E$6:$E$52,$E$59:$E$105,$E$112:E117)))","v":" "},null,null,null,6,"Ausblenden"]
[null,null,null,null,null,null,101,{"$f":"IF(D118+E118=0,\" \",SUM($H$5+SUM($D$6:$D$52,$D$59:$D$105,$D$112:D118)-SUM($E$6:$E$52,$E$59:$E$105,$E$112:E118)))","v":" "},null,null,null,6,"Ausblenden"]
[null,null,null,null,null,null,102,{"$f":"IF(D119+E119=0,\" \",SUM($H$5+SUM($D$6:$D$52,$D$59:$D$105,$D$112:D119)-SUM($E$6:$E$52,$E$59:$E$105,$E$112:E119)))","v":" "},null,null,null,6,"Ausblenden"]
[null,null,null,null,null,null,103,{"$f":"IF(D120+E120=0,\" \",SUM($H$5+SUM($D$6:$D$52,$D$59:$D$105,$D$112:D120)-SUM($E$6:$E$52,$E$59:$E$105,$E$112:E120)))","v":" "},null,null,null,6,"Ausblenden"]
[null,null,null,null,null,null,104,{"$f":"IF(D121+E121=0,\" \",SUM($H$5+SUM($D$6:$D$52,$D$59:$D$105,$D$112:D121)-SUM($E$6:$E$52,$E$59:$E$105,$E$112:E121)))","v":" "},null,null,null,6,"Ausblenden"]
[null,null,null,null,null,null,105,{"$f":"IF(D122+E122=0,\" \",SUM($H$5+SUM($D$6:$D$52,$D$59:$D$105,$D$112:D122)-SUM($E$6:$E$52,$E$59:$E$105,$E$112:E122)))","v":" "},null,null,null,6,"Ausblenden"]
[null,null,null,null,null,null,106,{"$f":"IF(D123+E123=0,\" \",SUM($H$5+SUM($D$6:$D$52,$D$59:$D$105,$D$112:D123)-SUM($E$6:$E$52,$E$59:$E$105,$E$112:E123)))","v":" "},null,null,null,6,"Ausblenden"]
[null,null,null,null,null,null,107,{"$f":"IF(D124+E124=0,\" \",SUM($H$5+SUM($D$6:$D$52,$D$59:$D$105,$D$112:D124)-SUM($E$6:$E$52,$E$59:$E$105,$E$112:E124)))","v":" "},null,null,null,6,"Ausblenden"]
[null,null,null,null,null,null,108,{"$f":"IF(D125+E125=0,\" \",SUM($H$5+SUM($D$6:$D$52,$D$59:$D$105,$D$112:D125)-SUM($E$6:$E$52,$E$59:$E$105,$E$112:E125)))","v":" "},null,null,null,6,"Ausblenden"]
[null,null,null,null,null,null,109,{"$f":"IF(D126+E126=0,\" \",SUM($H$5+SUM($D$6:$D$52,$D$59:$D$105,$D$112:D126)-SUM($E$6:$E$52,$E$59:$E$105,$E$112:E126)))","v":" "},null,null,null,6,"Ausblenden"]
[null,null,null,null,null,null,110,{"$f":"IF(D127+E127=0,\" \",SUM($H$5+SUM($D$6:$D$52,$D$59:$D$105,$D$112:D127)-SUM($E$6:$E$52,$E$59:$E$105,$E$112:E127)))","v":" "},null,null,null,6,"Ausblenden"]
[null,null,null,null,null,null,111,{"$f":"IF(D128+E128=0,\" \",SUM($H$5+SUM($D$6:$D$52,$D$59:$D$105,$D$112:D128)-SUM($E$6:$E$52,$E$59:$E$105,$E$112:E128)))","v":" "},null,null,null,6,"Ausblenden"]
[null,null,null,null,null,null,112,{"$f":"IF(D129+E129=0,\" \",SUM($H$5+SUM($D$6:$D$52,$D$59:$D$105,$D$112:D129)-SUM($E$6:$E$52,$E$59:$E$105,$E$112:E129)))","v":" "},null,null,null,6,"Ausblenden"]
[null,null,null,null,null,null,113,{"$f":"IF(D130+E130=0,\" \",SUM($H$5+SUM($D$6:$D$52,$D$59:$D$105,$D$112:D130)-SUM($E$6:$E$52,$E$59:$E$105,$E$112:E130)))","v":" "},null,null,null,6,"Ausblenden"]
[null,null,null,null,null,null,114,{"$f":"IF(D131+E131=0,\" \",SUM($H$5+SUM($D$6:$D$52,$D$59:$D$105,$D$112:D131)-SUM($E$6:$E$52,$E$59:$E$105,$E$112:E131)))","v":" "},null,null,null,6,"Ausblenden"]
[null,null,null,null,null,null,115,{"$f":"IF(D132+E132=0,\" \",SUM($H$5+SUM($D$6:$D$52,$D$59:$D$105,$D$112:D132)-SUM($E$6:$E$52,$E$59:$E$105,$E$112:E132)))","v":" "},null,null,null,6,"Ausblenden"]
[null,null,null,null,null,null,116,{"$f":"IF(D133+E133=0,\" \",SUM($H$5+SUM($D$6:$D$52,$D$59:$D$105,$D$112:D133)-SUM($E$6:$E$52,$E$59:$E$105,$E$112:E133)))","v":" "},null,null,null,6,"Ausblenden"]
[null,null,null,null,null,null,117,{"$f":"IF(D134+E134=0,\" \",SUM($H$5+SUM($D$6:$D$52,$D$59:$D$105,$D$112:D134)-SUM($E$6:$E$52,$E$59:$E$105,$E$112:E134)))","v":" "},null,null,null,6,"Ausblenden"]
[null,null,null,null,null,null,118,{"$f":"IF(D135+E135=0,\" \",SUM($H$5+SUM($D$6:$D$52,$D$59:$D$105,$D$112:D135)-SUM($E$6:$E$52,$E$59:$E$105,$E$112:E135)))","v":" "},null,null,null,6,"Ausblenden"]
[null,null,null,null,null,null,119,{"$f":"IF(D136+E136=0,\" \",SUM($H$5+SUM($D$6:$D$52,$D$59:$D$105,$D$112:D136)-SUM($E$6:$E$52,$E$59:$E$105,$E$112:E136)))","v":" "},null,null,null,6,"Ausblenden"]
[null,null,null,null,null,null,120,{"$f":"IF(D137+E137=0,\" \",SUM($H$5+SUM($D$6:$D$52,$D$59:$D$105,$D$112:D137)-SUM($E$6:$E$52,$E$59:$E$105,$E$112:E137)))","v":" "},null,null,null,6,"Ausblenden"]
[null,null,null,null,null,null,121,{"$f":"IF(D138+E138=0,\" \",SUM($H$5+SUM($D$6:$D$52,$D$59:$D$105,$D$112:D138)-SUM($E$6:$E$52,$E$59:$E$105,$E$112:E138)))","v":" "},null,null,null,6,"Ausblenden"]
[null,null,null,null,null,null,122,{"$f":"IF(D139+E139=0,\" \",SUM($H$5+SUM($D$6:$D$52,$D$59:$D$105,$D$112:D139)-SUM($E$6:$E$52,$E$59:$E$105,$E$112:E139)))","v":" "},null,null,null,6,"Ausblenden"]
[null,null,null,null,null,null,123,{"$f":"IF(D140+E140=0,\" \",SUM($H$5+SUM($D$6:$D$52,$D$59:$D$105,$D$112:D140)-SUM($E$6:$E$52,$E$59:$E$105,$E$112:E140)))","v":" "},null,null,null,6,"Ausblenden"]
[null,null,null,null,null,null,124,{"$f":"IF(D141+E141=0,\" \",SUM($H$5+SUM($D$6:$D$52,$D$59:$D$105,$D$112:D141)-SUM($E$6:$E$52,$E$59:$E$105,$E$112:E141)))","v":" "},null,null,null,6,"Ausblenden"]
[null,null,null,null,null,null,125,{"$f":"IF(D142+E142=0,\" \",SUM($H$5+SUM($D$6:$D$52,$D$59:$D$105,$D$112:D142)-SUM($E$6:$E$52,$E$59:$E$105,$E$112:E142)))","v":" "},null,null,null,6,"Ausblenden"]
[null,null,null,null,null,null,126,{"$f":"IF(D143+E143=0,\" \",SUM($H$5+SUM($D$6:$D$52,$D$59:$D$105,$D$112:D143)-SUM($E$6:$E$52,$E$59:$E$105,$E$112:E143)))","v":" "},null,null,null,6,"Ausblenden"]
[null,null,null,null,null,null,127,{"$f":"IF(D144+E144=0,\" \",SUM($H$5+SUM($D$6:$D$52,$D$59:$D$105,$D$112:D144)-SUM($E$6:$E$52,$E$59:$E$105,$E$112:E144)))","v":" "},null,null,null,6,"Ausblenden"]
[null,null,null,null,null,null,128,{"$f":"IF(D145+E145=0,\" \",SUM($H$5+SUM($D$6:$D$52,$D$59:$D$105,$D$112:D145)-SUM($E$6:$E$52,$E$59:$E$105,$E$112:E145)))","v":" "},null,null,null,6,"Ausblenden"]
[null,null,null,null,null,null,129,{"$f":"IF(D146+E146=0,\" \",SUM($H$5+SUM($D$6:$D$52,$D$59:$D$105,$D$112:D146)-SUM($E$6:$E$52,$E$59:$E$105,$E$112:E146)))","v":" "},null,null,null,6,"Ausblenden"]
[null,null,null,null,null,null,130,{"$f":"IF(D147+E147=0,\" \",SUM($H$5+SUM($D$6:$D$52,$D$59:$D$105,$D$112:D147)-SUM($E$6:$E$52,$E$59:$E$105,$E$112:E147)))","v":" "},null,null,null,6,"Ausblenden"]
[null,null,null,null,null,null,131,{"$f":"IF(D148+E148=0,\" \",SUM($H$5+SUM($D$6:$D$52,$D$59:$D$105,$D$112:D148)-SUM($E$6:$E$52,$E$59:$E$105,$E$112:E148)))","v":" "},null,null,null,6,"Ausblenden"]
[null,null,null,null,null,null,132,{"$f":"IF(D149+E149=0,\" \",SUM($H$5+SUM($D$6:$D$52,$D$59:$D$105,$D$112:D149)-SUM($E$6:$E$52,$E$59:$E$105,$E$112:E149)))","v":" "},null,null,null,6,"Ausblenden"]
[null,null,null,null,null,null,133,{"$f":"IF(D150+E150=0,\" \",SUM($H$5+SUM($D$6:$D$52,$D$59:$D$105,$D$112:D150)-SUM($E$6:$E$52,$E$59:$E$105,$E$112:E150)))","v":" "},null,null,null,6,"Ausblenden"]
[null,null,null,null,null,null,134,{"$f":"IF(D151+E151=0,\" \",SUM($H$5+SUM($D$6:$D$52,$D$59:$D$105,$D$112:D151)-SUM($E$6:$E$52,$E$59:$E$105,$E$112:E151)))","v":" "},null,null,null,6,"Ausblenden"]
[null,null,null,null,null,null,135,{"$f":"IF(D152+E152=0,\" \",SUM($H$5+SUM($D$6:$D$52,$D$59:$D$105,$D$112:D152)-SUM($E$6:$E$52,$E$59:$E$105,$E$112:E152)))","v":" "},null,null,null,6,"Ausblenden"]
[null,null,null,null,null,null,136,{"$f":"IF(D153+E153=0,\" \",SUM($H$5+SUM($D$6:$D$52,$D$59:$D$105,$D$112:D153)-SUM($E$6:$E$52,$E$59:$E$105,$E$112:E153)))","v":" "},null,null,null,6,"Ausblenden"]
[null,null,null,null,null,null,137,{"$f":"IF(D154+E154=0,\" \",SUM($H$5+SUM($D$6:$D$52,$D$59:$D$105,$D$112:D154)-SUM($E$6:$E$52,$E$59:$E$105,$E$112:E154)))","v":" "},null,null,null,6,"Ausblenden"]
[null,null,null,null,null,null,138,{"$f":"IF(D155+E155=0,\" \",SUM($H$5+SUM($D$6:$D$52,$D$59:$D$105,$D$112:D155)-SUM($E$6:$E$52,$E$59:$E$105,$E$112:E155)))","v":" "},null,null,null,6,"Ausblenden"]
[null,null,null,null,null,null,139,{"$f":"IF(D156+E156=0,\" \",SUM($H$5+SUM($D$6:$D$52,$D$59:$D$105,$D$112:D156)-SUM($E$6:$E$52,$E$59:$E$105,$E$112:E156)))","v":" "},null,null,null,6,"Ausblenden"]
[null,null,null,null,null,null,140,{"$f":"IF(D157+E157=0,\" \",SUM($H$5+SUM($D$6:$D$52,$D$59:$D$105,$D$112:D157)-SUM($E$6:$E$52,$E$59:$E$105,$E$112:E157)))","v":" "},null,null,null,6,"Ausblenden"]
[null,null,null,null,null,null,141,{"$f":"IF(D158+E158=0,\" \",SUM($H$5+SUM($D$6:$D$52,$D$59:$D$105,$D$112:D158)-SUM($E$6:$E$52,$E$59:$E$105,$E$112:E158)))","v":" "},null,null,null,6,"Ausblenden"]
[null,"Total",null,{"$f":"SUM(D111:D158)","v":0},{"$f":"SUM(E111:E158)","v":0},null,null,{"$f":"$H$5+D159-E159","v":0},null,null,null,null,{"$f":"IF(SUM($L$112:$L$158)<282,\"Einblenden\",\"Ausblenden\")","v":"Ausblenden"}]

{"sheet":"Dezember","index":12,"n_rows":159,"n_cols":13,"rows_kept":159,"cut":false,"hidden":false,"merged":[]}
[{"$f":"November!A1+31","v":"2023-12-08"}]
[]
["Datum:","Text","FIBU","Einnahmen","Ausgaben",{"$f":"Januar!F3","v":"?"},null,"Saldo"]
[]
[1,"Saldovortrag",null,null,null,null,null,{"$f":"SUM(November!H159)","v":0}]
[null,null,null,null,null,null,1,{"$f":"IF(D6+E6=0,\" \",SUM($H$5+SUM($D$6:D6)-SUM($E$6:E6)))","v":" "},null,null,null,null,"Einblenden"]
[null,null,null,null,null,null,2,{"$f":"IF(D7+E7=0,\" \",SUM($H$5+SUM($D$6:D7)-SUM($E$6:E7)))","v":" "},null,null,null,{"$f":"COUNTIF(A7:F7,\"\")","v":6},{"$f":"IF(L7<6,\"Einblenden\",\"Ausblenden\")","v":"Ausblenden"}]
[null,null,null,null,null,null,3,{"$f":"IF(D8+E8=0,\" \",SUM($H$5+SUM($D$6:D8)-SUM($E$6:E8)))","v":" "},null,null,null,{"$f":"COUNTIF(A8:F8,\"\")","v":6},{"$f":"IF(L8<6,\"Einblenden\",\"Ausblenden\")","v":"Ausblenden"}]
[null,null,null,null,null,null,4,{"$f":"IF(D9+E9=0,\" \",SUM($H$5+SUM($D$6:D9)-SUM($E$6:E9)))","v":" "},null,null,null,6,"Ausblenden"]
[null,null,null,null,null,null,5,{"$f":"IF(D10+E10=0,\" \",SUM($H$5+SUM($D$6:D10)-SUM($E$6:E10)))","v":" "},null,null,null,6,"Ausblenden"]
[null,null,null,null,null,null,6,{"$f":"IF(D11+E11=0,\" \",SUM($H$5+SUM($D$6:D11)-SUM($E$6:E11)))","v":" "},null,null,null,6,"Ausblenden"]
[null,null,null,null,null,null,7,{"$f":"IF(D12+E12=0,\" \",SUM($H$5+SUM($D$6:D12)-SUM($E$6:E12)))","v":" "},null,null,null,6,"Ausblenden"]
[null,null,null,null,null,null,8,{"$f":"IF(D13+E13=0,\" \",SUM($H$5+SUM($D$6:D13)-SUM($E$6:E13)))","v":" "},null,null,null,6,"Ausblenden"]
[null,null,null,null,null,null,9,{"$f":"IF(D14+E14=0,\" \",SUM($H$5+SUM($D$6:D14)-SUM($E$6:E14)))","v":" "},null,null,null,6,"Ausblenden"]
[null,null,null,null,null,null,10,{"$f":"IF(D15+E15=0,\" \",SUM($H$5+SUM($D$6:D15)-SUM($E$6:E15)))","v":" "},null,null,null,6,"Ausblenden"]
[null,null,null,null,null,null,11,{"$f":"IF(D16+E16=0,\" \",SUM($H$5+SUM($D$6:D16)-SUM($E$6:E16)))","v":" "},null,null,null,6,"Ausblenden"]
[null,null,null,null,null,null,12,{"$f":"IF(D17+E17=0,\" \",SUM($H$5+SUM($D$6:D17)-SUM($E$6:E17)))","v":" "},null,null,null,6,"Ausblenden"]
[null,null,null,null,null,null,13,{"$f":"IF(D18+E18=0,\" \",SUM($H$5+SUM($D$6:D18)-SUM($E$6:E18)))","v":" "},null,null,null,6,"Ausblenden"]
[null,null,null,null,null,null,14,{"$f":"IF(D19+E19=0,\" \",SUM($H$5+SUM($D$6:D19)-SUM($E$6:E19)))","v":" "},null,null,null,6,"Ausblenden"]
[null,null,null,null,null,null,15,{"$f":"IF(D20+E20=0,\" \",SUM($H$5+SUM($D$6:D20)-SUM($E$6:E20)))","v":" "},null,null,null,6,"Ausblenden"]
[null,null,null,null,null,null,16,{"$f":"IF(D21+E21=0,\" \",SUM($H$5+SUM($D$6:D21)-SUM($E$6:E21)))","v":" "},null,null,null,6,"Ausblenden"]
[null,null,null,null,null,null,17,{"$f":"IF(D22+E22=0,\" \",SUM($H$5+SUM($D$6:D22)-SUM($E$6:E22)))","v":" "},null,null,null,6,"Ausblenden"]
[null,null,null,null,null,null,18,{"$f":"IF(D23+E23=0,\" \",SUM($H$5+SUM($D$6:D23)-SUM($E$6:E23)))","v":" "},null,null,null,6,"Ausblenden"]
[null,null,null,null,null,null,19,{"$f":"IF(D24+E24=0,\" \",SUM($H$5+SUM($D$6:D24)-SUM($E$6:E24)))","v":" "},null,null,null,6,"Ausblenden"]
[null,null,null,null,null,null,20,{"$f":"IF(D25+E25=0,\" \",SUM($H$5+SUM($D$6:D25)-SUM($E$6:E25)))","v":" "},null,null,null,6,"Ausblenden"]
[null,null,null,null,null,null,21,{"$f":"IF(D26+E26=0,\" \",SUM($H$5+SUM($D$6:D26)-SUM($E$6:E26)))","v":" "},null,null,null,6,"Ausblenden"]
[null,null,null,null,null,null,22,{"$f":"IF(D27+E27=0,\" \",SUM($H$5+SUM($D$6:D27)-SUM($E$6:E27)))","v":" "},null,null,null,6,"Ausblenden"]
[null,null,null,null,null,null,23,{"$f":"IF(D28+E28=0,\" \",SUM($H$5+SUM($D$6:D28)-SUM($E$6:E28)))","v":" "},null,null,null,6,"Ausblenden"]
[null,null,null,null,null,null,24,{"$f":"IF(D29+E29=0,\" \",SUM($H$5+SUM($D$6:D29)-SUM($E$6:E29)))","v":" "},null,null,null,6,"Ausblenden"]
[null,null,null,null,null,null,25,{"$f":"IF(D30+E30=0,\" \",SUM($H$5+SUM($D$6:D30)-SUM($E$6:E30)))","v":" "},null,null,null,6,"Ausblenden"]
[null,null,null,null,null,null,26,{"$f":"IF(D31+E31=0,\" \",SUM($H$5+SUM($D$6:D31)-SUM($E$6:E31)))","v":" "},null,null,null,6,"Ausblenden"]
[null,null,null,null,null,null,27,{"$f":"IF(D32+E32=0,\" \",SUM($H$5+SUM($D$6:D32)-SUM($E$6:E32)))","v":" "},null,null,null,6,"Ausblenden"]
[null,null,null,null,null,null,28,{"$f":"IF(D33+E33=0,\" \",SUM($H$5+SUM($D$6:D33)-SUM($E$6:E33)))","v":" "},null,null,null,6,"Ausblenden"]
[null,null,null,null,null,null,29,{"$f":"IF(D34+E34=0,\" \",SUM($H$5+SUM($D$6:D34)-SUM($E$6:E34)))","v":" "},null,null,null,6,"Ausblenden"]
[null,null,null,null,null,null,30,{"$f":"IF(D35+E35=0,\" \",SUM($H$5+SUM($D$6:D35)-SUM($E$6:E35)))","v":" "},null,null,null,6,"Ausblenden"]
[null,null,null,null,null,null,31,{"$f":"IF(D36+E36=0,\" \",SUM($H$5+SUM($D$6:D36)-SUM($E$6:E36)))","v":" "},null,null,null,6,"Ausblenden"]
[null,null,null,null,null,null,32,{"$f":"IF(D37+E37=0,\" \",SUM($H$5+SUM($D$6:D37)-SUM($E$6:E37)))","v":" "},null,null,null,6,"Ausblenden"]
[null,null,null,null,null,null,33,{"$f":"IF(D38+E38=0,\" \",SUM($H$5+SUM($D$6:D38)-SUM($E$6:E38)))","v":" "},null,null,null,6,"Ausblenden"]
[null,null,null,null,null,null,34,{"$f":"IF(D39+E39=0,\" \",SUM($H$5+SUM($D$6:D39)-SUM($E$6:E39)))","v":" "},null,null,null,6,"Ausblenden"]
[null,null,null,null,null,null,35,{"$f":"IF(D40+E40=0,\" \",SUM($H$5+SUM($D$6:D40)-SUM($E$6:E40)))","v":" "},null,null,null,6,"Ausblenden"]
[null,null,null,null,null,null,36,{"$f":"IF(D41+E41=0,\" \",SUM($H$5+SUM($D$6:D41)-SUM($E$6:E41)))","v":" "},null,null,null,6,"Ausblenden"]
[null,null,null,null,null,null,37,{"$f":"IF(D42+E42=0,\" \",SUM($H$5+SUM($D$6:D42)-SUM($E$6:E42)))","v":" "},null,null,null,6,"Ausblenden"]
[null,null,null,null,null,null,38,{"$f":"IF(D43+E43=0,\" \",SUM($H$5+SUM($D$6:D43)-SUM($E$6:E43)))","v":" "},null,null,null,6,"Ausblenden"]
[null,null,null,null,null,null,39,{"$f":"IF(D44+E44=0,\" \",SUM($H$5+SUM($D$6:D44)-SUM($E$6:E44)))","v":" "},null,null,null,6,"Ausblenden"]
[null,null,null,null,null,null,40,{"$f":"IF(D45+E45=0,\" \",SUM($H$5+SUM($D$6:D45)-SUM($E$6:E45)))","v":" "},null,null,null,6,"Ausblenden"]
[null,null,null,null,null,null,41,{"$f":"IF(D46+E46=0,\" \",SUM($H$5+SUM($D$6:D46)-SUM($E$6:E46)))","v":" "},null,null,null,6,"Ausblenden"]
[null,null,null,null,null,null,42,{"$f":"IF(D47+E47=0,\" \",SUM($H$5+SUM($D$6:D47)-SUM($E$6:E47)))","v":" "},null,null,null,6,"Ausblenden"]
[null,null,null,null,null,null,43,{"$f":"IF(D48+E48=0,\" \",SUM($H$5+SUM($D$6:D48)-SUM($E$6:E48)))","v":" "},null,null,null,6,"Ausblenden"]
[null,null,null,null,null,null,44,{"$f":"IF(D49+E49=0,\" \",SUM($H$5+SUM($D$6:D49)-SUM($E$6:E49)))","v":" "},null,null,null,6,"Ausblenden"]
[null,null,null,null,null,null,45,{"$f":"IF(D50+E50=0,\" \",SUM($H$5+SUM($D$6:D50)-SUM($E$6:E50)))","v":" "},null,null,null,6,"Ausblenden"]
[null,null,null,null,null,null,46,{"$f":"IF(D51+E51=0,\" \",SUM($H$5+SUM($D$6:D51)-SUM($E$6:E51)))","v":" "},null,null,null,6,"Ausblenden"]
[null,null,null,null,null,null,47,{"$f":"IF(D52+E52=0,\" \",SUM($H$5+SUM($D$6:D52)-SUM($E$6:E52)))","v":" "},null,null,null,6,"Ausblenden"]
[null,{"$f":"IF(SUM(D59:E105)<>0,\"Uebertrag\",\"Total\")","v":"Total"},null,{"$f":"SUM(D5:D52)","v":0},{"$f":"SUM(E5:E52)","v":0},null,null,{"$f":"H5+D53-E53","v":0},null,null,null,null,"Einblenden"]
[{"$f":"A1","v":"2023-12-08"},null,null,null,null,null,null,"Seite 2",null,null,null,null,{"$f":"IF(SUM($L$59:$L$105)<282,\"Einblenden\",\"Ausblenden\")","v":"Ausblenden"}]
[null,null,null,null,null,null,null,null,null,null,null,null,{"$f":"IF(SUM($L$59:$L$105)<282,\"Einblenden\",\"Ausblenden\")","v":"Ausblenden"}]
["Datum:","Text","FIBU","Einnahmen","Ausgaben",{"$f":"F3","v":"?"},null,"Saldo",null,null,null,null,{"$f":"IF(SUM($L$59:$L$105)<282,\"Einblenden\",\"Ausblenden\")","v":"Ausblenden"}]
[null,null,null,null,null,null,null,null,null,null,null,null,{"$f":"IF(SUM($L$59:$L$105)<282,\"Einblenden\",\"Ausblenden\")","v":"Ausblenden"}]
[null,"Uebertrag",null,{"$f":"D53","v":0},{"$f":"E53","v":0},null,null,{"$f":"H53","v":0},null,null,null,null,{"$f":"IF(SUM($L$59:$L$105)<282,\"Einblenden\",\"Ausblenden\")","v":"Ausblenden"}]
[null,null,null,null,null,null,48,{"$f":"IF(D59+E59=0,\" \",SUM($H$5+SUM($D$6:$D$52,$D$59:D59)-SUM($E$6:$E$52,$E$59:E59)))","v":" "},null,null,null,{"$f":"COUNTIF(A59:F59,\"\")","v":6},{"$f":"IF(L59<6,\"Einblenden\",\"Ausblenden\")","v":"Ausblenden"}]
[null,null,null,null,null,null,49,{"$f":"IF(D60+E60=0,\" \",SUM($H$5+SUM($D$6:$D$52,$D$59:D60)-SUM($E$6:$E$52,$E$59:E60)))","v":" "},null,null,null,{"$f":"COUNTIF(A60:F60,\"\")","v":6},{"$f":"IF(L60<6,\"Einblenden\",\"Ausblenden\")","v":"Ausblenden"}]
[null,null,null,null,null,null,50,{"$f":"IF(D61+E61=0,\" \",SUM($H$5+SUM($D$6:$D$52,$D$59:D61)-SUM($E$6:$E$52,$E$59:E61)))","v":" "},null,null,null,6,"Ausblenden"]
[null,null,null,null,null,null,51,{"$f":"IF(D62+E62=0,\" \",SUM($H$5+SUM($D$6:$D$52,$D$59:D62)-SUM($E$6:$E$52,$E$59:E62)))","v":" "},null,null,null,6,"Ausblenden"]
[null,null,null,null,null,null,52,{"$f":"IF(D63+E63=0,\" \",SUM($H$5+SUM($D$6:$D$52,$D$59:D63)-SUM($E$6:$E$52,$E$59:E63)))","v":" "},null,null,null,6,"Ausblenden"]
[null,null,null,null,null,null,53,{"$f":"IF(D64+E64=0,\" \",SUM($H$5+SUM($D$6:$D$52,$D$59:D64)-SUM($E$6:$E$52,$E$59:E64)))","v":" "},null,null,null,6,"Ausblenden"]
[null,null,null,null,null,null,54,{"$f":"IF(D65+E65=0,\" \",SUM($H$5+SUM($D$6:$D$52,$D$59:D65)-SUM($E$6:$E$52,$E$59:E65)))","v":" "},null,null,null,6,"Ausblenden"]
[null,null,null,null,null,null,55,{"$f":"IF(D66+E66=0,\" \",SUM($H$5+SUM($D$6:$D$52,$D$59:D66)-SUM($E$6:$E$52,$E$59:E66)))","v":" "},null,null,null,6,"Ausblenden"]
[null,null,null,null,null,null,56,{"$f":"IF(D67+E67=0,\" \",SUM($H$5+SUM($D$6:$D$52,$D$59:D67)-SUM($E$6:$E$52,$E$59:E67)))","v":" "},null,null,null,6,"Ausblenden"]
[null,null,null,null,null,null,57,{"$f":"IF(D68+E68=0,\" \",SUM($H$5+SUM($D$6:$D$52,$D$59:D68)-SUM($E$6:$E$52,$E$59:E68)))","v":" "},null,null,null,6,"Ausblenden"]
[null,null,null,null,null,null,58,{"$f":"IF(D69+E69=0,\" \",SUM($H$5+SUM($D$6:$D$52,$D$59:D69)-SUM($E$6:$E$52,$E$59:E69)))","v":" "},null,null,null,6,"Ausblenden"]
[null,null,null,null,null,null,59,{"$f":"IF(D70+E70=0,\" \",SUM($H$5+SUM($D$6:$D$52,$D$59:D70)-SUM($E$6:$E$52,$E$59:E70)))","v":" "},null,null,null,6,"Ausblenden"]
[null,null,null,null,null,null,60,{"$f":"IF(D71+E71=0,\" \",SUM($H$5+SUM($D$6:$D$52,$D$59:D71)-SUM($E$6:$E$52,$E$59:E71)))","v":" "},null,null,null,6,"Ausblenden"]
[null,null,null,null,null,null,61,{"$f":"IF(D72+E72=0,\" \",SUM($H$5+SUM($D$6:$D$52,$D$59:D72)-SUM($E$6:$E$52,$E$59:E72)))","v":" "},null,null,null,6,"Ausblenden"]
[null,null,null,null,null,null,62,{"$f":"IF(D73+E73=0,\" \",SUM($H$5+SUM($D$6:$D$52,$D$59:D73)-SUM($E$6:$E$52,$E$59:E73)))","v":" "},null,null,null,6,"Ausblenden"]
[null,null,null,null,null,null,63,{"$f":"IF(D74+E74=0,\" \",SUM($H$5+SUM($D$6:$D$52,$D$59:D74)-SUM($E$6:$E$52,$E$59:E74)))","v":" "},null,null,null,6,"Ausblenden"]
[null,null,null,null,null,null,64,{"$f":"IF(D75+E75=0,\" \",SUM($H$5+SUM($D$6:$D$52,$D$59:D75)-SUM($E$6:$E$52,$E$59:E75)))","v":" "},null,null,null,6,"Ausblenden"]
[null,null,null,null,null,null,65,{"$f":"IF(D76+E76=0,\" \",SUM($H$5+SUM($D$6:$D$52,$D$59:D76)-SUM($E$6:$E$52,$E$59:E76)))","v":" "},null,null,null,6,"Ausblenden"]
[null,null,null,null,null,null,66,{"$f":"IF(D77+E77=0,\" \",SUM($H$5+SUM($D$6:$D$52,$D$59:D77)-SUM($E$6:$E$52,$E$59:E77)))","v":" "},null,null,null,6,"Ausblenden"]
[null,null,null,null,null,null,67,{"$f":"IF(D78+E78=0,\" \",SUM($H$5+SUM($D$6:$D$52,$D$59:D78)-SUM($E$6:$E$52,$E$59:E78)))","v":" "},null,null,null,6,"Ausblenden"]
[null,null,null,null,null,null,68,{"$f":"IF(D79+E79=0,\" \",SUM($H$5+SUM($D$6:$D$52,$D$59:D79)-SUM($E$6:$E$52,$E$59:E79)))","v":" "},null,null,null,6,"Ausblenden"]
[null,null,null,null,null,null,69,{"$f":"IF(D80+E80=0,\" \",SUM($H$5+SUM($D$6:$D$52,$D$59:D80)-SUM($E$6:$E$52,$E$59:E80)))","v":" "},null,null,null,6,"Ausblenden"]
[null,null,null,null,null,null,70,{"$f":"IF(D81+E81=0,\" \",SUM($H$5+SUM($D$6:$D$52,$D$59:D81)-SUM($E$6:$E$52,$E$59:E81)))","v":" "},null,null,null,6,"Ausblenden"]
[null,null,null,null,null,null,71,{"$f":"IF(D82+E82=0,\" \",SUM($H$5+SUM($D$6:$D$52,$D$59:D82)-SUM($E$6:$E$52,$E$59:E82)))","v":" "},null,null,null,6,"Ausblenden"]
[null,null,null,null,null,null,72,{"$f":"IF(D83+E83=0,\" \",SUM($H$5+SUM($D$6:$D$52,$D$59:D83)-SUM($E$6:$E$52,$E$59:E83)))","v":" "},null,null,null,6,"Ausblenden"]
[null,null,null,null,null,null,73,{"$f":"IF(D84+E84=0,\" \",SUM($H$5+SUM($D$6:$D$52,$D$59:D84)-SUM($E$6:$E$52,$E$59:E84)))","v":" "},null,null,null,6,"Ausblenden"]
[null,null,null,null,null,null,74,{"$f":"IF(D85+E85=0,\" \",SUM($H$5+SUM($D$6:$D$52,$D$59:D85)-SUM($E$6:$E$52,$E$59:E85)))","v":" "},null,null,null,6,"Ausblenden"]
[null,null,null,null,null,null,75,{"$f":"IF(D86+E86=0,\" \",SUM($H$5+SUM($D$6:$D$52,$D$59:D86)-SUM($E$6:$E$52,$E$59:E86)))","v":" "},null,null,null,6,"Ausblenden"]
[null,null,null,null,null,null,76,{"$f":"IF(D87+E87=0,\" \",SUM($H$5+SUM($D$6:$D$52,$D$59:D87)-SUM($E$6:$E$52,$E$59:E87)))","v":" "},null,null,null,6,"Ausblenden"]
[null,null,null,null,null,null,77,{"$f":"IF(D88+E88=0,\" \",SUM($H$5+SUM($D$6:$D$52,$D$59:D88)-SUM($E$6:$E$52,$E$59:E88)))","v":" "},null,null,null,6,"Ausblenden"]
[null,null,null,null,null,null,78,{"$f":"IF(D89+E89=0,\" \",SUM($H$5+SUM($D$6:$D$52,$D$59:D89)-SUM($E$6:$E$52,$E$59:E89)))","v":" "},null,null,null,6,"Ausblenden"]
[null,null,null,null,null,null,79,{"$f":"IF(D90+E90=0,\" \",SUM($H$5+SUM($D$6:$D$52,$D$59:D90)-SUM($E$6:$E$52,$E$59:E90)))","v":" "},null,null,null,6,"Ausblenden"]
[null,null,null,null,null,null,80,{"$f":"IF(D91+E91=0,\" \",SUM($H$5+SUM($D$6:$D$52,$D$59:D91)-SUM($E$6:$E$52,$E$59:E91)))","v":" "},null,null,null,6,"Ausblenden"]
[null,null,null,null,null,null,81,{"$f":"IF(D92+E92=0,\" \",SUM($H$5+SUM($D$6:$D$52,$D$59:D92)-SUM($E$6:$E$52,$E$59:E92)))","v":" "},null,null,null,6,"Ausblenden"]
[null,null,null,null,null,null,82,{"$f":"IF(D93+E93=0,\" \",SUM($H$5+SUM($D$6:$D$52,$D$59:D93)-SUM($E$6:$E$52,$E$59:E93)))","v":" "},null,null,null,6,"Ausblenden"]
[null,null,null,null,null,null,83,{"$f":"IF(D94+E94=0,\" \",SUM($H$5+SUM($D$6:$D$52,$D$59:D94)-SUM($E$6:$E$52,$E$59:E94)))","v":" "},null,null,null,6,"Ausblenden"]
[null,null,null,null,null,null,84,{"$f":"IF(D95+E95=0,\" \",SUM($H$5+SUM($D$6:$D$52,$D$59:D95)-SUM($E$6:$E$52,$E$59:E95)))","v":" "},null,null,null,6,"Ausblenden"]
[null,null,null,null,null,null,85,{"$f":"IF(D96+E96=0,\" \",SUM($H$5+SUM($D$6:$D$52,$D$59:D96)-SUM($E$6:$E$52,$E$59:E96)))","v":" "},null,null,null,6,"Ausblenden"]
[null,null,null,null,null,null,86,{"$f":"IF(D97+E97=0,\" \",SUM($H$5+SUM($D$6:$D$52,$D$59:D97)-SUM($E$6:$E$52,$E$59:E97)))","v":" "},null,null,null,6,"Ausblenden"]
[null,null,null,null,null,null,87,{"$f":"IF(D98+E98=0,\" \",SUM($H$5+SUM($D$6:$D$52,$D$59:D98)-SUM($E$6:$E$52,$E$59:E98)))","v":" "},null,null,null,6,"Ausblenden"]
[null,null,null,null,null,null,88,{"$f":"IF(D99+E99=0,\" \",SUM($H$5+SUM($D$6:$D$52,$D$59:D99)-SUM($E$6:$E$52,$E$59:E99)))","v":" "},null,null,null,6,"Ausblenden"]
[null,null,null,null,null,null,89,{"$f":"IF(D100+E100=0,\" \",SUM($H$5+SUM($D$6:$D$52,$D$59:D100)-SUM($E$6:$E$52,$E$59:E100)))","v":" "},null,null,null,6,"Ausblenden"]
[null,null,null,null,null,null,90,{"$f":"IF(D101+E101=0,\" \",SUM($H$5+SUM($D$6:$D$52,$D$59:D101)-SUM($E$6:$E$52,$E$59:E101)))","v":" "},null,null,null,6,"Ausblenden"]
[null,null,null,null,null,null,91,{"$f":"IF(D102+E102=0,\" \",SUM($H$5+SUM($D$6:$D$52,$D$59:D102)-SUM($E$6:$E$52,$E$59:E102)))","v":" "},null,null,null,6,"Ausblenden"]
[null,null,null,null,null,null,92,{"$f":"IF(D103+E103=0,\" \",SUM($H$5+SUM($D$6:$D$52,$D$59:D103)-SUM($E$6:$E$52,$E$59:E103)))","v":" "},null,null,null,6,"Ausblenden"]
[null,null,null,null,null,null,93,{"$f":"IF(D104+E104=0,\" \",SUM($H$5+SUM($D$6:$D$52,$D$59:D104)-SUM($E$6:$E$52,$E$59:E104)))","v":" "},null,null,null,6,"Ausblenden"]
[null,null,null,null,null,null,94,{"$f":"IF(D105+E105=0,\" \",SUM($H$5+SUM($D$6:$D$52,$D$59:D105)-SUM($E$6:$E$52,$E$59:E105)))","v":" "},null,null,null,{"$f":"COUNTIF(A105:F105,\"\")","v":6},"Ausblenden"]
[null,{"$f":"IF(SUM(D112:E158)<>0,\"Uebertrag\",\"Total\")","v":"Total"},null,{"$f":"SUM(D58:D105)","v":0},{"$f":"SUM(E58:E105)","v":0},null,null,{"$f":"$H$5+D106-E106","v":0},null,null,null,null,{"$f":"IF(SUM($L$59:$L$105)<282,\"Einblenden\",\"Ausblenden\")","v":"Ausblenden"}]
[{"$f":"A1","v":"2023-12-08"},null,null,null,null,null,null,"Seite 3",null,null,null,null,{"$f":"IF(SUM($L$112:$L$158)<282,\"Einblenden\",\"Ausblenden\")","v":"Ausblenden"}]
[null,null,null,null,null,null,null,null,null,null,null,null,{"$f":"IF(SUM($L$112:$L$158)<282,\"Einblenden\",\"Ausblenden\")","v":"Ausblenden"}]
["Datum:","Text","FIBU","Einnahmen","Ausgaben",{"$f":"F3","v":"?"},null,"Saldo",null,null,null,null,{"$f":"IF(SUM($L$112:$L$158)<282,\"Einblenden\",\"Ausblenden\")","v":"Ausblenden"}]
[null,null,null,null,null,null,null,null,null,null,null,null,{"$f":"IF(SUM($L$112:$L$158)<282,\"Einblenden\",\"Ausblenden\")","v":"Ausblenden"}]
[null,"Uebertrag",null,{"$f":"D106","v":0},{"$f":"E106","v":0},null,null,{"$f":"H106","v":0},null,null,null,null,{"$f":"IF(SUM($L$112:$L$158)<282,\"Einblenden\",\"Ausblenden\")","v":"Ausblenden"}]
[null,null,null,null,null,null,95,{"$f":"IF(D112+E112=0,\" \",SUM($H$5+SUM($D$6:$D$52,$D$59:$D$105,$D$112:D112)-SUM($E$6:$E$52,$E$59:$E$105,$E$112:E112)))","v":" "},null,null,null,{"$f":"COUNTIF(A112:F112,\"\")","v":6},{"$f":"IF(L112<6,\"Einblenden\",\"Ausblenden\")","v":"Ausblenden"}]
[null,null,null,null,null,null,96,{"$f":"IF(D113+E113=0,\" \",SUM($H$5+SUM($D$6:$D$52,$D$59:$D$105,$D$112:D113)-SUM($E$6:$E$52,$E$59:$E$105,$E$112:E113)))","v":" "},null,null,null,{"$f":"COUNTIF(A113:F113,\"\")","v":6},"Ausblenden"]
[null,null,null,null,null,null,97,{"$f":"IF(D114+E114=0,\" \",SUM($H$5+SUM($D$6:$D$52,$D$59:$D$105,$D$112:D114)-SUM($E$6:$E$52,$E$59:$E$105,$E$112:E114)))","v":" "},null,null,null,6,"Ausblenden"]
[null,null,null,null,null,null,98,{"$f":"IF(D115+E115=0,\" \",SUM($H$5+SUM($D$6:$D$52,$D$59:$D$105,$D$112:D115)-SUM($E$6:$E$52,$E$59:$E$105,$E$112:E115)))","v":" "},null,null,null,6,"Ausblenden"]
[null,null,null,null,null,null,99,{"$f":"IF(D116+E116=0,\" \",SUM($H$5+SUM($D$6:$D$52,$D$59:$D$105,$D$112:D116)-SUM($E$6:$E$52,$E$59:$E$105,$E$112:E116)))","v":" "},null,null,null,6,"Ausblenden"]
[null,null,null,null,null,null,100,{"$f":"IF(D117+E117=0,\" \",SUM($H$5+SUM($D$6:$D$52,$D$59:$D$105,$D$112:D117)-SUM($E$6:$E$52,$E$59:$E$105,$E$112:E117)))","v":" "},null,null,null,6,"Ausblenden"]
[null,null,null,null,null,null,101,{"$f":"IF(D118+E118=0,\" \",SUM($H$5+SUM($D$6:$D$52,$D$59:$D$105,$D$112:D118)-SUM($E$6:$E$52,$E$59:$E$105,$E$112:E118)))","v":" "},null,null,null,6,"Ausblenden"]
[null,null,null,null,null,null,102,{"$f":"IF(D119+E119=0,\" \",SUM($H$5+SUM($D$6:$D$52,$D$59:$D$105,$D$112:D119)-SUM($E$6:$E$52,$E$59:$E$105,$E$112:E119)))","v":" "},null,null,null,6,"Ausblenden"]
[null,null,null,null,null,null,103,{"$f":"IF(D120+E120=0,\" \",SUM($H$5+SUM($D$6:$D$52,$D$59:$D$105,$D$112:D120)-SUM($E$6:$E$52,$E$59:$E$105,$E$112:E120)))","v":" "},null,null,null,6,"Ausblenden"]
[null,null,null,null,null,null,104,{"$f":"IF(D121+E121=0,\" \",SUM($H$5+SUM($D$6:$D$52,$D$59:$D$105,$D$112:D121)-SUM($E$6:$E$52,$E$59:$E$105,$E$112:E121)))","v":" "},null,null,null,6,"Ausblenden"]
[null,null,null,null,null,null,105,{"$f":"IF(D122+E122=0,\" \",SUM($H$5+SUM($D$6:$D$52,$D$59:$D$105,$D$112:D122)-SUM($E$6:$E$52,$E$59:$E$105,$E$112:E122)))","v":" "},null,null,null,6,"Ausblenden"]
[null,null,null,null,null,null,106,{"$f":"IF(D123+E123=0,\" \",SUM($H$5+SUM($D$6:$D$52,$D$59:$D$105,$D$112:D123)-SUM($E$6:$E$52,$E$59:$E$105,$E$112:E123)))","v":" "},null,null,null,6,"Ausblenden"]
[null,null,null,null,null,null,107,{"$f":"IF(D124+E124=0,\" \",SUM($H$5+SUM($D$6:$D$52,$D$59:$D$105,$D$112:D124)-SUM($E$6:$E$52,$E$59:$E$105,$E$112:E124)))","v":" "},null,null,null,6,"Ausblenden"]
[null,null,null,null,null,null,108,{"$f":"IF(D125+E125=0,\" \",SUM($H$5+SUM($D$6:$D$52,$D$59:$D$105,$D$112:D125)-SUM($E$6:$E$52,$E$59:$E$105,$E$112:E125)))","v":" "},null,null,null,6,"Ausblenden"]
[null,null,null,null,null,null,109,{"$f":"IF(D126+E126=0,\" \",SUM($H$5+SUM($D$6:$D$52,$D$59:$D$105,$D$112:D126)-SUM($E$6:$E$52,$E$59:$E$105,$E$112:E126)))","v":" "},null,null,null,6,"Ausblenden"]
[null,null,null,null,null,null,110,{"$f":"IF(D127+E127=0,\" \",SUM($H$5+SUM($D$6:$D$52,$D$59:$D$105,$D$112:D127)-SUM($E$6:$E$52,$E$59:$E$105,$E$112:E127)))","v":" "},null,null,null,6,"Ausblenden"]
[null,null,null,null,null,null,111,{"$f":"IF(D128+E128=0,\" \",SUM($H$5+SUM($D$6:$D$52,$D$59:$D$105,$D$112:D128)-SUM($E$6:$E$52,$E$59:$E$105,$E$112:E128)))","v":" "},null,null,null,6,"Ausblenden"]
[null,null,null,null,null,null,112,{"$f":"IF(D129+E129=0,\" \",SUM($H$5+SUM($D$6:$D$52,$D$59:$D$105,$D$112:D129)-SUM($E$6:$E$52,$E$59:$E$105,$E$112:E129)))","v":" "},null,null,null,6,"Ausblenden"]
[null,null,null,null,null,null,113,{"$f":"IF(D130+E130=0,\" \",SUM($H$5+SUM($D$6:$D$52,$D$59:$D$105,$D$112:D130)-SUM($E$6:$E$52,$E$59:$E$105,$E$112:E130)))","v":" "},null,null,null,6,"Ausblenden"]
[null,null,null,null,null,null,114,{"$f":"IF(D131+E131=0,\" \",SUM($H$5+SUM($D$6:$D$52,$D$59:$D$105,$D$112:D131)-SUM($E$6:$E$52,$E$59:$E$105,$E$112:E131)))","v":" "},null,null,null,6,"Ausblenden"]
[null,null,null,null,null,null,115,{"$f":"IF(D132+E132=0,\" \",SUM($H$5+SUM($D$6:$D$52,$D$59:$D$105,$D$112:D132)-SUM($E$6:$E$52,$E$59:$E$105,$E$112:E132)))","v":" "},null,null,null,6,"Ausblenden"]
[null,null,null,null,null,null,116,{"$f":"IF(D133+E133=0,\" \",SUM($H$5+SUM($D$6:$D$52,$D$59:$D$105,$D$112:D133)-SUM($E$6:$E$52,$E$59:$E$105,$E$112:E133)))","v":" "},null,null,null,6,"Ausblenden"]
[null,null,null,null,null,null,117,{"$f":"IF(D134+E134=0,\" \",SUM($H$5+SUM($D$6:$D$52,$D$59:$D$105,$D$112:D134)-SUM($E$6:$E$52,$E$59:$E$105,$E$112:E134)))","v":" "},null,null,null,6,"Ausblenden"]
[null,null,null,null,null,null,118,{"$f":"IF(D135+E135=0,\" \",SUM($H$5+SUM($D$6:$D$52,$D$59:$D$105,$D$112:D135)-SUM($E$6:$E$52,$E$59:$E$105,$E$112:E135)))","v":" "},null,null,null,6,"Ausblenden"]
[null,null,null,null,null,null,119,{"$f":"IF(D136+E136=0,\" \",SUM($H$5+SUM($D$6:$D$52,$D$59:$D$105,$D$112:D136)-SUM($E$6:$E$52,$E$59:$E$105,$E$112:E136)))","v":" "},null,null,null,6,"Ausblenden"]
[null,null,null,null,null,null,120,{"$f":"IF(D137+E137=0,\" \",SUM($H$5+SUM($D$6:$D$52,$D$59:$D$105,$D$112:D137)-SUM($E$6:$E$52,$E$59:$E$105,$E$112:E137)))","v":" "},null,null,null,6,"Ausblenden"]
[null,null,null,null,null,null,121,{"$f":"IF(D138+E138=0,\" \",SUM($H$5+SUM($D$6:$D$52,$D$59:$D$105,$D$112:D138)-SUM($E$6:$E$52,$E$59:$E$105,$E$112:E138)))","v":" "},null,null,null,6,"Ausblenden"]
[null,null,null,null,null,null,122,{"$f":"IF(D139+E139=0,\" \",SUM($H$5+SUM($D$6:$D$52,$D$59:$D$105,$D$112:D139)-SUM($E$6:$E$52,$E$59:$E$105,$E$112:E139)))","v":" "},null,null,null,6,"Ausblenden"]
[null,null,null,null,null,null,123,{"$f":"IF(D140+E140=0,\" \",SUM($H$5+SUM($D$6:$D$52,$D$59:$D$105,$D$112:D140)-SUM($E$6:$E$52,$E$59:$E$105,$E$112:E140)))","v":" "},null,null,null,6,"Ausblenden"]
[null,null,null,null,null,null,124,{"$f":"IF(D141+E141=0,\" \",SUM($H$5+SUM($D$6:$D$52,$D$59:$D$105,$D$112:D141)-SUM($E$6:$E$52,$E$59:$E$105,$E$112:E141)))","v":" "},null,null,null,6,"Ausblenden"]
[null,null,null,null,null,null,125,{"$f":"IF(D142+E142=0,\" \",SUM($H$5+SUM($D$6:$D$52,$D$59:$D$105,$D$112:D142)-SUM($E$6:$E$52,$E$59:$E$105,$E$112:E142)))","v":" "},null,null,null,6,"Ausblenden"]
[null,null,null,null,null,null,126,{"$f":"IF(D143+E143=0,\" \",SUM($H$5+SUM($D$6:$D$52,$D$59:$D$105,$D$112:D143)-SUM($E$6:$E$52,$E$59:$E$105,$E$112:E143)))","v":" "},null,null,null,6,"Ausblenden"]
[null,null,null,null,null,null,127,{"$f":"IF(D144+E144=0,\" \",SUM($H$5+SUM($D$6:$D$52,$D$59:$D$105,$D$112:D144)-SUM($E$6:$E$52,$E$59:$E$105,$E$112:E144)))","v":" "},null,null,null,6,"Ausblenden"]
[null,null,null,null,null,null,128,{"$f":"IF(D145+E145=0,\" \",SUM($H$5+SUM($D$6:$D$52,$D$59:$D$105,$D$112:D145)-SUM($E$6:$E$52,$E$59:$E$105,$E$112:E145)))","v":" "},null,null,null,6,"Ausblenden"]
[null,null,null,null,null,null,129,{"$f":"IF(D146+E146=0,\" \",SUM($H$5+SUM($D$6:$D$52,$D$59:$D$105,$D$112:D146)-SUM($E$6:$E$52,$E$59:$E$105,$E$112:E146)))","v":" "},null,null,null,6,"Ausblenden"]
[null,null,null,null,null,null,130,{"$f":"IF(D147+E147=0,\" \",SUM($H$5+SUM($D$6:$D$52,$D$59:$D$105,$D$112:D147)-SUM($E$6:$E$52,$E$59:$E$105,$E$112:E147)))","v":" "},null,null,null,6,"Ausblenden"]
[null,null,null,null,null,null,131,{"$f":"IF(D148+E148=0,\" \",SUM($H$5+SUM($D$6:$D$52,$D$59:$D$105,$D$112:D148)-SUM($E$6:$E$52,$E$59:$E$105,$E$112:E148)))","v":" "},null,null,null,6,"Ausblenden"]
[null,null,null,null,null,null,132,{"$f":"IF(D149+E149=0,\" \",SUM($H$5+SUM($D$6:$D$52,$D$59:$D$105,$D$112:D149)-SUM($E$6:$E$52,$E$59:$E$105,$E$112:E149)))","v":" "},null,null,null,6,"Ausblenden"]
[null,null,null,null,null,null,133,{"$f":"IF(D150+E150=0,\" \",SUM($H$5+SUM($D$6:$D$52,$D$59:$D$105,$D$112:D150)-SUM($E$6:$E$52,$E$59:$E$105,$E$112:E150)))","v":" "},null,null,null,6,"Ausblenden"]
[null,null,null,null,null,null,134,{"$f":"IF(D151+E151=0,\" \",SUM($H$5+SUM($D$6:$D$52,$D$59:$D$105,$D$112:D151)-SUM($E$6:$E$52,$E$59:$E$105,$E$112:E151)))","v":" "},null,null,null,6,"Ausblenden"]
[null,null,null,null,null,null,135,{"$f":"IF(D152+E152=0,\" \",SUM($H$5+SUM($D$6:$D$52,$D$59:$D$105,$D$112:D152)-SUM($E$6:$E$52,$E$59:$E$105,$E$112:E152)))","v":" "},null,null,null,6,"Ausblenden"]
[null,null,null,null,null,null,136,{"$f":"IF(D153+E153=0,\" \",SUM($H$5+SUM($D$6:$D$52,$D$59:$D$105,$D$112:D153)-SUM($E$6:$E$52,$E$59:$E$105,$E$112:E153)))","v":" "},null,null,null,6,"Ausblenden"]
[null,null,null,null,null,null,137,{"$f":"IF(D154+E154=0,\" \",SUM($H$5+SUM($D$6:$D$52,$D$59:$D$105,$D$112:D154)-SUM($E$6:$E$52,$E$59:$E$105,$E$112:E154)))","v":" "},null,null,null,6,"Ausblenden"]
[null,null,null,null,null,null,138,{"$f":"IF(D155+E155=0,\" \",SUM($H$5+SUM($D$6:$D$52,$D$59:$D$105,$D$112:D155)-SUM($E$6:$E$52,$E$59:$E$105,$E$112:E155)))","v":" "},null,null,null,6,"Ausblenden"]
[null,null,null,null,null,null,139,{"$f":"IF(D156+E156=0,\" \",SUM($H$5+SUM($D$6:$D$52,$D$59:$D$105,$D$112:D156)-SUM($E$6:$E$52,$E$59:$E$105,$E$112:E156)))","v":" "},null,null,null,6,"Ausblenden"]
[null,null,null,null,null,null,140,{"$f":"IF(D157+E157=0,\" \",SUM($H$5+SUM($D$6:$D$52,$D$59:$D$105,$D$112:D157)-SUM($E$6:$E$52,$E$59:$E$105,$E$112:E157)))","v":" "},null,null,null,6,"Ausblenden"]
[null,null,null,null,null,null,141,{"$f":"IF(D158+E158=0,\" \",SUM($H$5+SUM($D$6:$D$52,$D$59:$D$105,$D$112:D158)-SUM($E$6:$E$52,$E$59:$E$105,$E$112:E158)))","v":" "},null,null,null,6,"Ausblenden"]
[null,"Total",null,{"$f":"SUM(D111:D158)","v":0},{"$f":"SUM(E111:E158)","v":0},null,null,{"$f":"$H$5+D159-E159","v":0},null,null,null,null,{"$f":"IF(SUM($L$112:$L$158)<282,\"Einblenden\",\"Ausblenden\")","v":"Ausblenden"}]